program: Gaussian 09
title: 000100300
version: EM64L-G09RevD.01
frameworkgroup: C1[X(C8H9NO)]
method: RPBEPBE
basis: SDD
operation: Freq
keyword: #pfreq=noraman
keyword: PBEPBE/SDD
title: #p freq=noraman PBEPBE/SDD
converged: NO NO NO NO
title: Mulliken charges:
elementType: O N C C C C C C C C H H H H H H H H H
charge: -0.165956 0.001098 0.365496 0.362960 -0.042447 -0.416026 -0.415563 -0.219134 -0.808528 -0.807390 0.239461 0.239542 0.229774 0.243263 0.248588 0.226745 0.246870 0.244627 0.226619
chargesum: 0.00000
title: Mulliken charges with hydrogens summed into heavy atoms:
elementType: O N C C C C C C C C
charge: -0.165956 0.001098 0.365496 0.362960 -0.042447 -0.176565 -0.176020 0.010640 -0.089931 -0.089275
polarizability: 1.15422181e+02 -1.52538173e+00 1.10575672e+02 -3.98401922e-01 2.03437404e-01 5.24396557e+01
1716.lowfreq: -217.0549 -18.5834 -11.7273 -0.0010 -0.0007 0.0005 5.1091 106.7618 112.9811
frequency: -217.0501 106.7566 112.9463 117.3733 189.3672 218.0944 222.4084 258.1153 381.7631 434.3630 467.8929 497.9394 518.0894 583.7918 658.9544 756.1534 774.2249 796.3572 897.6945 912.5104 975.5049 982.0618 1035.3178 1044.1993 1045.2920 1063.3402 1118.5982 1178.1482 1251.4936 1265.6789 1364.2302 1373.8177 1401.0134 1402.2418 1418.3499 1444.1870 1465.8789 1467.7518 1480.7399 1482.6220 1587.7767 1594.2632 2981.5143 2982.0615 3059.1379 3060.0303 3095.8628 3096.2651 3126.7629 3135.9661 3161.3943
redmass: 11.3329 3.9195 1.0549 1.0500 4.3820 4.8395 2.8858 2.7680 4.9297 2.9237 4.9794 3.1235 5.6710 4.4131 3.7255 5.0868 1.3839 4.4451 1.3163 2.7227 1.3459 1.5278 1.7213 1.5231 1.5773 3.6239 2.0201 1.1682 1.6201 3.6660 7.4636 6.1361 1.2469 1.2520 2.9786 1.9965 1.0582 1.0645 1.1729 1.1836 7.5195 5.5186 1.0376 1.0376 1.0974 1.0975 1.0989 1.0987 1.0860 1.0920 1.0993
irintensity: 0.5338 1.5364 0.4274 0.9897 3.4576 3.5951 0.0627 1.5917 4.3325 0.7606 2.0237 0.2157 0.4079 0.5757 10.1155 2.2213 47.9805 12.3678 0.0494 5.3036 0.1574 0.6072 0.3891 0.6499 15.0108 0.7611 13.3990 1.2007 0.1003 1.4309 0.8408 58.9765 19.1596 6.8864 7.3898 2.2549 25.4147 7.1712 17.6090 25.7226 4.4562 2.6848 24.7986 12.6376 13.0924 11.7823 19.5388 15.9665 0.1163 20.1731 23.7420
temp: 298.150 k
press: 1.00000 atm
elementType: 8 7 6 6 6 6 6 6 6 6 1 1 1 1 1 1 1 1 1
symmnumber: 1
zpe: 389063.3 jmol-1
zpe.correction: 0.148186 hartree
zpe.thermalcorrener: 0.157563 hartree
zpe.thermalcorrenthalpy: 0.158507 hartree
zpe.thermalcorrgfe: 0.113774 hartree
zpe.sumelectzpe: -439.413941 hartree
zpe.sumelectthermal: -439.404564 hartree
zpe.sumelectthermalent: -439.403620 hartree
zpe.sumelectthermalfe: -439.448353 hartree
dipole: 2.2904 -0.7635 0.0711
dipole: 2.4153
quadrupole: -60.2338 -50.4013 -63.2073
quadrupole: 3.7377 -1.0701 0.2360
quadrupole: -2.2864 7.5461 -5.2598 3.7377 -1.0701 0.2360
hfenergy: -439.5621271 hartree
pointgroup: C01 [X(C8H9N1O1)]
dipole: -0.9502172 -0.0060866 0.0067917 debye
dipolederiv: -0.4838764 -0.0011075 -0.0441216 -0.0664509 -0.1050493 0.0055434 0.5193032 0.0117698 -0.2650956 0.624465 0.002505 0.0047788 0.0829495 -0.1870067 -0.0151119 -0.3902197 -0.0182499 0.1864643 0.058365 0.1253735 0.015389 0.0285678 0.2531431 0.0383901 0.0418533 -0.00528 -0.0125014 0.0698179 -0.1256263 0.0175521 -0.0272865 0.2559797 -0.0364742 -0.0251771 0.0091459 -0.0097838 -0.1848294 0.0015121 0.0060795 -0.0122969 -0.0147363 0.0056908 -0.1528559 0.0018399 -0.1121203 -0.1012285 -0.1573625 0.0172278 -0.0154939 -0.04635 -0.0183815 0.0326456 -0.0208674 -0.1769993 -0.100324 0.1566883 0.0175071 0.0160129 -0.0479846 0.0195786 0.0364286 0.0223464 -0.1778471 0.1335904 -0.0003241 0.031742 -0.0003185 0.0206517 0.0001156 0.0323558 0.0015622 -0.1257629 -0.0313457 -0.1545615 -0.0110457 -0.0976545 -0.0588438 -0.0073849 -0.0045503 0.0094951 0.047601 -0.0268353 0.1564054 -0.0118009 0.0936697 -0.0620955 0.0083555 0.0006898 -0.0025866 0.0470418 0.0367969 0.0648194 -0.0122473 0.088984 -0.0753169 0.0102354 -0.0202892 0.0035526 0.1555848 0.0356021 -0.0651204 -0.0121731 -0.0889094 -0.0745863 -0.0108358 -0.0123688 -0.0074717 0.1557741 -0.1235871 0.0002927 -0.0357454 0.0004074 0.0813 0.0000089 -0.0400399 -0.0001776 0.1534755 0.0312584 -0.0309014 -0.1019475 -0.0113026 0.0511208 0.0310239 -0.1060477 -0.0311147 -0.0272201 0.0242431 -0.0603075 0.09757 -0.0206167 0.0364235 -0.0124106 0.1025605 0.0404976 -0.019607 -0.006449 0.1639524 0.0113326 0.0611659 -0.0562199 -0.0149634 -0.0059216 -0.0051721 0.1140504 0.0224157 0.0602878 0.0984106 0.0227715 0.0340314 0.0114932 0.1036104 -0.0422194 -0.0222001 0.0288933 0.0278977 -0.1010861 0.0068384 0.0513651 -0.0302448 -0.1069242 0.0285487 -0.0245824 -0.0069724 -0.1644232 0.0125781 -0.0610374 -0.0558259 0.0153719 -0.0050528 0.0043812 0.1137282 unknown
polarizability: 115.7982229|0.274886|110.1480022|1.8556596|-0.1528122|52.491284 unknown
InChI: InChI=1S/C8H9NO/c1-6-4-3-5-7(2)8(6)9-10/h3-5H,1-2H3
charge 0 multiplicity 1
19 atoms
O  2.645238 0.036506 -0.556197
N  1.888202 -0.0082 0.466929
C  -0.238388 1.246667 0.069579
C  -0.243047 -1.251024 0.070985
C  0.425361 -0.003482 0.152693
C  -1.642072 1.224144 -0.118395
C  -1.646324 -1.223906 -0.118993
C  -2.341986 0.001351 -0.212974
C  0.526326 2.554244 0.170254
C  0.51813 -2.56044 0.172132
H  -2.184093 2.174086 -0.188113
H  -2.191344 -2.172022 -0.190174
H  -3.427842 0.003282 -0.355298
H  1.169651 2.580214 1.069615
H  1.186985 2.705128 -0.703729
H  -0.166179 3.410334 0.219655
H  1.176084 -2.715218 -0.703296
H  1.164206 -2.585221 1.069605
H  -0.176308 -3.414741 0.225521
