program: Gaussian 09
title: 000009248
version: EM64L-G09RevD.01
frameworkgroup: C1[X(C12H22O)]
method: RPBEPBE
basis: SDD
operation: Freq
keyword: #pfreq=noraman
keyword: PBEPBE/SDD
title: #p freq=noraman PBEPBE/SDD
converged: YES YES NO NO
title: Mulliken charges:
elementType: O C C C C C C C C C C C C H H H H H H H H H H H H H H H H H H H H H H
charge: -0.312964 -0.067012 -0.090074 -0.434096 -0.434346 -0.374003 -0.400428 -0.386160 -0.366477 -0.384112 -0.390599 -0.395058 -0.389376 0.217875 0.219673 0.205392 0.208323 0.217969 0.207303 0.200646 0.195110 0.197760 0.198004 0.192102 0.189534 0.205401 0.194354 0.198724 0.204232 0.197029 0.194960 0.200099 0.193689 0.192586 0.193943
chargesum: 0.00000
title: Mulliken charges with hydrogens summed into heavy atoms:
elementType: O C C C C C C C C C C C C
charge: -0.312964 0.150863 0.129599 -0.020381 -0.009074 0.021753 -0.004664 -0.004524 0.033278 0.018843 0.001390 -0.001270 -0.002847
polarizability: 1.36330289e+02 -3.88101902e+00 1.38130957e+02 -1.57093819e+00 1.24725854e+00 1.06020272e+02
1716.lowfreq: -16.4985 -11.9760 -0.0001 0.0004 0.0006 16.6435 42.0950 88.4137 103.0136
frequency: 41.8873 88.3978 102.9491 141.5654 163.8683 194.4024 214.8097 230.4948 241.7288 273.0897 287.2521 296.7730 334.8892 374.8074 413.5105 425.1176 466.2701 486.0089 514.4781 691.5877 709.4356 740.6089 764.5998 773.1863 789.6339 811.9178 820.6663 851.9875 877.8584 895.0871 922.7394 962.4305 981.3444 989.3528 1006.1987 1029.1949 1047.8392 1073.2077 1080.2448 1085.0590 1094.9766 1114.3002 1121.3477 1129.8432 1150.7660 1152.0117 1177.2278 1195.1767 1221.5013 1230.4767 1243.6320 1264.0631 1275.0586 1284.0298 1293.9584 1299.0652 1306.6694 1319.9455 1330.6969 1339.5128 1340.8091 1348.8874 1350.1199 1352.8318 1357.2885 1365.2670 1437.7860 1459.8079 1461.2158 1462.2546 1463.8624 1465.8226 1467.0495 1468.4452 1475.5756 1479.8877 1486.2152 2958.5403 2959.4978 2963.0387 2970.9540 2972.3868 2977.4209 2977.6326 2981.0962 2985.2141 2989.0034 3006.1785 3011.2527 3014.8136 3021.3573 3023.9863 3033.0368 3036.8520 3039.2824 3044.6767 3053.6222 3057.1274 3087.7363
redmass: 3.0814 2.9262 3.1169 3.4591 2.7701 2.5575 2.5703 1.8075 2.5644 2.0693 2.2851 2.3281 2.0224 2.7010 2.4971 2.6539 3.0703 2.2891 2.3039 1.2344 2.3849 1.6048 2.8422 1.8849 2.0067 1.8483 2.0766 2.0070 2.3030 1.9180 2.0619 1.8485 1.8175 1.9596 1.5474 1.7156 1.6805 1.4243 1.2737 2.1830 2.3029 1.9835 2.4394 2.3940 1.5385 1.3159 1.3595 1.3928 1.2998 1.3724 1.2317 1.2511 1.3307 1.1995 1.1730 1.2362 1.2194 1.2206 1.3279 1.3494 1.3732 1.3915 1.4117 1.3724 1.4656 1.4688 2.6397 1.0901 1.0889 1.0873 1.0958 1.0915 1.0929 1.0862 1.0896 1.0903 1.0926 1.0599 1.0605 1.0609 1.0610 1.0621 1.0626 1.0626 1.0642 1.0637 1.0621 1.0974 1.0985 1.0998 1.0988 1.0984 1.0966 1.0983 1.0965 1.1008 1.0987 1.0939 1.0897
irintensity: 0.7685 0.6066 1.1967 0.4634 1.2558 1.0886 0.6487 0.4060 0.3395 0.7354 1.5916 1.8576 0.4671 2.1028 1.9888 0.5155 7.6579 3.7676 0.3151 10.5112 5.1118 11.3524 21.9757 2.3153 11.0737 5.7110 4.4855 7.2293 9.7508 8.6959 6.5256 8.9039 1.2872 3.2161 1.6427 5.0994 1.8724 1.5535 1.1901 1.0074 0.6732 1.7313 0.3576 1.1904 0.5011 0.3037 0.2930 4.5655 1.4467 2.0930 0.9507 2.3477 4.7564 1.2018 0.6991 0.3300 1.3919 1.0342 1.6938 0.2927 2.1987 0.8275 0.4778 0.7555 0.2009 0.5658 4.1920 9.4243 1.9473 6.9257 9.5751 4.0753 11.3629 17.7568 5.7747 1.0068 32.0644 32.4516 34.1759 24.1357 13.5540 54.3857 29.0388 51.6972 24.0186 32.4279 16.6475 16.2461 28.0586 14.1181 18.6402 60.3047 34.4744 98.6703 19.4764 121.2276 94.8542 57.6373 48.8354
temp: 298.150 k
press: 1.00000 atm
elementType: 8 6 6 6 6 6 6 6 6 6 6 6 6 1 1 1 1 1 1 1 1 1 1 1 1 1 1 1 1 1 1 1 1 1 1
symmnumber: 1
zpe: 832293.3 jmol-1
zpe.correction: 0.317004 hartree
zpe.thermalcorrener: 0.330569 hartree
zpe.thermalcorrenthalpy: 0.331514 hartree
zpe.thermalcorrgfe: 0.277586 hartree
zpe.sumelectzpe: -544.587872 hartree
zpe.sumelectthermal: -544.574307 hartree
zpe.sumelectthermalent: -544.573363 hartree
zpe.sumelectthermalfe: -544.627290 hartree
dipole: 2.4065 1.0478 1.0269
dipole: 2.8185
quadrupole: -91.5592 -80.4753 -81.5995
quadrupole: -6.1012 -4.3754 -1.3052
quadrupole: -7.0145 4.0694 2.9452 -6.1012 -4.3754 -1.3052
hfenergy: -544.9048762 hartree
pointgroup: C01[X(C12H22O1)]
dipole: -0.9617031 -0.3751691 0.4049351 debye
polarizability: 136.0079715|-3.8107727|138.4976708|1.2898444|-0.8797582|105.9758755 unknown
InChI: InChI=1S/C12H22O/c1-2-4-6-8-10-12-11(13-12)9-7-5-3-1/h11-12H,1-10H2
charge 0 multiplicity 1
35 atoms
O  2.864434 1.037296 -0.644284
C  1.357199 1.137433 -0.477019
C  2.106312 0.010005 0.176142
C  0.866374 2.356996 0.286567
C  2.125573 -1.409133 -0.371341
C  -0.536801 2.234401 0.948918
C  1.349722 -2.424222 0.512174
C  -1.760786 2.243221 -0.009013
C  -0.14113 -2.076491 0.750824
C  -2.081049 0.897874 -0.713783
C  -1.016416 -2.113073 -0.524195
C  -2.621069 -0.1965 0.243018
C  -2.479979 -1.644242 -0.299132
H  0.834513 0.894146 -1.41249
H  2.309049 0.106796 1.255213
H  0.870537 3.23051 -0.396515
H  1.615801 2.572423 1.073299
H  3.181842 -1.736351 -0.443341
H  1.731948 -1.404285 -1.4053
H  -0.638697 3.095546 1.639294
H  -0.56286 1.330417 1.590134
H  1.860391 -2.500685 1.494305
H  1.425906 -3.425969 0.043202
H  -1.60386 3.032452 -0.773136
H  -2.656802 2.549979 0.569535
H  -0.198976 -1.072977 1.214757
H  -0.563401 -2.784347 1.493453
H  -1.175056 0.528989 -1.226731
H  -2.829342 1.075957 -1.512601
H  -1.029573 -3.148953 -0.921014
H  -0.549828 -1.493982 -1.315096
H  -3.690361 0.006576 0.454832
H  -2.105403 -0.126996 1.220116
H  -2.973768 -2.339432 0.410961
H  -3.033742 -1.730081 -1.256854
