program: Gaussian 09
title: 000100265
version: EM64L-G09RevD.01
frameworkgroup: C1[X(C9H6F6N2O)]
method: RPBEPBE
basis: SDD
operation: Freq
keyword: #p
keyword: freq=noraman
keyword: PBEPBE/SDD
title: #p freq=noraman PBEPBE/SDD
converged: YES YES NO NO
title: Mulliken charges:
elementType: F F F F F F O N N C C C C C C C C C H H H H H H
charge: -0.153843 -0.158866 -0.157226 -0.163226 -0.155064 -0.154509 -0.255278 -0.396650 -0.495818 0.326954 0.323812 0.350470 -0.456078 -0.471273 -0.470344 0.261162 0.250353 0.137082 0.298071 0.312779 0.267604 0.335653 0.313599 0.310637
chargesum: 0.00000
title: Mulliken charges with hydrogens summed into heavy atoms:
elementType: F F F F F F O N N C C C C C C C C C
charge: -0.153843 -0.158866 -0.157226 -0.163226 -0.155064 -0.154509 -0.255278 -0.060997 0.128418 0.326954 0.323812 0.350470 -0.158007 -0.158494 -0.202740 0.261162 0.250353 0.137082
polarizability: 1.55638184e+02 4.83588505e+00 1.31719008e+02 3.96824420e-01 3.35378575e+00 6.62233662e+01
1716.lowfreq: -4.8630 -0.0003 0.0001 0.0005 1.0584 4.6417 13.7846 17.0989 37.0663
frequency: 13.7161 16.9559 37.0607 71.2383 85.8388 106.2289 106.9430 129.8637 142.7374 196.6265 236.5080 251.8051 265.7924 288.6032 293.6165 315.4526 317.6851 389.8294 396.2309 438.0437 440.3117 477.1422 507.2562 533.8867 567.3995 581.5167 608.0174 626.0715 636.7100 701.2132 739.1205 741.7942 765.0952 790.7279 895.6991 924.8333 937.5865 967.3573 987.6361 995.7836 999.6726 1018.2188 1032.4903 1046.5926 1096.3587 1109.7483 1181.4961 1230.6460 1267.3292 1285.3731 1296.5000 1349.2861 1395.0527 1433.4640 1445.0549 1467.7276 1591.7895 1614.7508 1625.5441 1678.3997 3157.5170 3168.8627 3176.2592 3395.6611 3514.0359 3550.3348
redmass: 17.3834 18.2893 6.8637 8.2684 7.0208 2.0327 3.2992 3.0158 7.5575 4.9747 4.4763 13.4968 8.5398 8.1011 5.8484 8.8004 6.8815 8.6145 10.3624 7.7900 11.2857 10.7468 12.8210 3.2324 1.5513 6.6352 13.1124 14.7748 7.6252 2.4065 8.6069 4.4019 1.6948 11.8077 8.8331 1.7550 1.4408 1.5745 6.2342 7.6847 7.5476 8.0609 7.9812 8.1181 2.9435 2.5182 2.2688 2.4332 2.2675 1.1765 1.3223 5.1572 9.1096 2.4253 3.6123 2.3965 7.8595 6.3334 6.6765 1.0616 1.0923 1.0928 1.0936 1.0429 1.0990 1.0792
irintensity: 0.0506 0.0813 2.4378 3.7285 1.0934 17.1296 9.7896 4.9810 0.2387 2.8121 2.9656 0.0224 9.7183 4.2112 0.2455 2.7558 30.9237 1.9100 7.9533 5.0188 0.5114 4.4522 2.0023 49.7842 110.4796 1.8015 27.4556 13.3278 0.3677 20.7210 17.8798 9.5694 159.5177 52.5258 16.9386 103.8364 28.5398 26.1996 0.5280 33.5477 330.2996 56.3862 51.8271 154.9553 173.7049 75.9797 45.2908 439.1406 148.6564 1.8320 25.3314 57.1485 0.7719 86.9249 11.9468 68.1798 92.3413 10.9940 58.9096 30.0832 0.9725 6.3082 2.8780 3.0333 4.3194 35.9784
temp: 298.150 k
press: 1.00000 atm
elementType: 9 9 9 9 9 9 8 7 7 6 6 6 6 6 6 6 6 6 1 1 1 1 1 1
symmnumber: 1
zpe: 386717.4 jmol-1
zpe.correction: 0.147293 hartree
zpe.thermalcorrener: 0.164499 hartree
zpe.thermalcorrenthalpy: 0.165443 hartree
zpe.thermalcorrgfe: 0.098854 hartree
zpe.sumelectzpe: -1129.013284 hartree
zpe.sumelectthermal: -1128.996078 hartree
zpe.sumelectthermalent: -1128.995134 hartree
zpe.sumelectthermalfe: -1129.061723 hartree
dipole: -3.0259 0.9600 0.7347
dipole: 3.2584
quadrupole: -98.5402 -117.8230 -103.1949
quadrupole: 1.2157 -0.6832 -2.0063
quadrupole: 7.9792 -11.3036 3.3244 1.2157 -0.6832 -2.0063
hfenergy: -1129.1605768 hartree
pointgroup: C01 [X(C9H6F6N2O1)]
dipole: -1.195858 0.3512801 0.2998939 debye
dipolederiv: -0.3917984 0.0473956 -0.0372436 0.0628912 -0.7550086 -0.2083466 -0.054897 -0.1591874 -0.3784076 -0.7936726 -0.0389198 0.2075292 -0.0231917 -0.3773084 0.0844202 0.1584423 0.0903172 -0.3925714 -0.510809 0.1763398 -0.1641218 0.1979366 -0.4006521 0.1234312 -0.2196397 0.1525097 -0.7574379 -0.5028054 0.1847761 0.1723615 0.1601705 -0.6538722 -0.1279239 0.1508336 -0.0826935 -0.3913198 -0.6450886 -0.2028623 -0.1986405 -0.2233599 -0.5277579 -0.0688651 -0.1712121 -0.033072 -0.3784256 -0.2697712 -0.051203 0.0224737 -0.081693 -0.6311273 0.2073563 0.0518933 0.2683776 -0.7619582 -0.6819374 -0.2104207 -0.0065461 0.0451531 -0.8387325 -0.1997988 0.1044126 -0.1255831 -0.4144278 -0.5196928 0.2411634 0.111636 0.4993937 -0.3666926 0.0160769 0.2168796 0.0841822 -0.4069379 -0.3153009 0.0980838 0.0963093 0.1951137 -0.2284208 -0.1422474 0.1389127 -0.1073764 -0.1364786 -0.2457649 0.0554358 0.0089558 0.0634416 -0.1973746 -0.0026134 0.0772725 -0.0466372 -0.1427295 -0.212542 -0.0769255 0.0021183 -0.0246517 -0.3251366 0.0002114 -0.0127654 -0.0750883 -0.1286654 -0.2106213 -0.002209 0.0062076 -0.0227718 -0.1734375 -0.0242906 -0.0338455 -0.0264459 0.0158156 -0.021098 -0.0206277 0.0011722 -0.0545861 0.0334937 0.0011933 -0.0081 0.0201722 -0.0598393 -0.00435 -0.0500895 0.0045946 -0.0050097 0.0144676 -0.0064475 -0.0350217 0.0261717 -0.0532307 0.013386 0.0669669 0.0057971 -0.010308 0.0395272 -0.0148932 0.0579524 0.0268797 -0.0900601 1.818994 -0.3391595 -0.0022549 -0.4102592 1.5797626 0.0003082 0.0751276 -0.0556681 1.5402888 1.3338015 0.1241394 0.0003843 0.2131122 2.0638256 -0.0191865 -0.0247698 -0.1121735 1.5390551 1.3410768 0.0437368 -0.1830092 -0.2298639 0.9809256 0.351096 -0.2791596 0.2389767 0.3462624 0.0718466 -0.0280127 -0.0004545 -0.0278926 0.1309382 0.0018269 0.0018359 0.0000028 0.1564911 0.1730416 -0.0179255 0.0004231 0.0072495 0.0802513 0.0082392 0.0171564 -0.0023033 0.151875 0.0297674 0.0700239 -0.0028247 0.0743594 0.0931307 0.0058922 -0.0129317 -0.0090457 0.1437938 0.1521005 -0.0727332 -0.0033686 -0.1309801 0.1639345 -0.0624435 -0.0269965 -0.089166 0.3001708 0.1761539 0.0509044 -0.0707991 -0.0806224 0.0731056 0.1137233 -0.1375983 0.0239349 0.2526108 0.2150841 -0.0478774 0.0293005 -0.1936313 0.2221584 -0.0367184 -0.0337815 -0.0070845 0.0461264 unknown
polarizability: 155.2431182|5.6327009|132.2391074|-2.0247326|0.0609298|66.0983334 unknown
InChI: InChI=1S/C9H6F6N2O/c10-8(11,12)5-1-4(7(18)17-16)2-6(3-5)9(13,14)15/h1-3,17H,16H2
charge 0 multiplicity 1
24 atoms
F  2.097169 -3.036289 -0.473057
F  3.527063 -1.270207 -0.503656
F  2.741503 -2.062379 1.468062
F  -0.46536 3.662035 0.472819
F  1.781854 3.316939 0.446208
F  0.614275 3.356527 -1.494469
O  -2.780885 -2.281887 -0.366723
N  -3.637899 -0.280606 0.446412
N  -4.979147 -0.744824 0.496108
C  1.200917 -0.839389 0.040307
C  0.334687 1.428684 -0.036115
C  -1.215658 -0.46337 0.020256
C  1.437923 0.552226 0.005573
C  -0.112578 -1.349397 0.040246
C  -0.988051 0.931535 -0.029671
C  2.369551 -1.78677 0.122874
C  0.566165 2.91222 -0.145003
C  -2.592802 -1.084822 0.00755
H  2.459354 0.943402 0.001959
H  -0.308571 -2.426252 0.038191
H  -1.820388 1.639816 -0.092092
H  -3.479959 0.62247 0.89546
H  -5.031845 -1.63392 1.014596
H  -5.355118 -0.859943 -0.455535
