program: Gaussian 09
title: 000100285
version: EM64L-G09RevD.01
frameworkgroup: C1[X(C16H16ClN5O2)]
method: RPBEPBE
basis: SDD
operation: Freq
keyword: #p
keyword: freq=noraman
keyword: PBEPBE/SDD
title: #p freq=noraman PBEPBE/SDD
converged: YES YES NO NO
title: Mulliken charges:
elementType: Cl O O N N N N N C C C C C C C C C C C C C C C C H H H H H H H H H H H H H H H H
charge: -0.057905 -0.328458 -0.212222 -0.439768 -0.082950 -0.024138 -0.443969 -0.623490 -0.482963 0.436245 0.055703 -0.087714 0.343442 -0.567711 0.042054 0.258371 -0.349463 -0.367433 -0.235366 -0.215538 -0.105212 0.259511 -0.213286 -0.675066 0.229451 0.232193 0.304045 0.218883 0.234778 0.266214 0.334799 0.253153 0.254956 0.335198 0.331638 0.228017 0.226891 0.211879 0.227584 0.227650
chargesum: 0.00000
title: Mulliken charges with hydrogens summed into heavy atoms:
elementType: Cl O O N N N N N C C C C C C C C C C C C C C C C
charge: -0.057905 -0.328458 -0.212222 -0.135723 -0.082950 -0.024138 -0.109169 0.043346 -0.021319 0.436245 0.055703 -0.087714 0.343442 -0.348829 0.042054 0.258371 -0.114686 -0.101219 0.017787 0.039417 -0.105212 0.259511 0.241622 -0.007954
polarizability: 5.73063763e+02 -1.04465672e+01 2.25592871e+02 -3.75317100e-01 1.05893567e+00 1.01282267e+02
1716.lowfreq: -7.5127 -4.2613 0.0008 0.0012 0.0020 1.0987 13.7667 21.7750 27.0485
frequency: 12.9771 21.6052 27.0081 43.5970 46.3862 59.0575 80.5654 90.2255 93.0512 133.1138 158.6373 160.9072 183.2325 208.0414 216.8391 226.3083 250.6024 267.5583 283.7363 292.8737 312.6010 368.2520 390.7239 409.4913 421.0503 446.0861 451.2733 486.5236 489.7748 510.0732 517.4213 552.9977 566.6395 589.1654 591.4140 619.6154 625.5539 651.8599 660.1164 667.8426 691.2955 705.0406 713.8798 729.4779 757.0480 796.2820 801.3817 802.7930 812.1035 837.7014 845.3443 870.7003 909.0987 941.5092 965.0169 981.3158 985.4258 995.6472 1015.0685 1041.2397 1058.8571 1072.4602 1083.7503 1108.1375 1115.1584 1140.6799 1149.5696 1162.2002 1185.0606 1201.7380 1228.9233 1241.6426 1249.8118 1274.4786 1296.1566 1329.9485 1349.7459 1359.9517 1368.3438 1387.5644 1400.5793 1402.1178 1454.1561 1463.7162 1468.8910 1476.8809 1477.5170 1488.4740 1489.7976 1496.6105 1506.8318 1548.1002 1567.1607 1574.0205 1597.6680 1605.9523 1612.1601 1698.5327 2880.8922 2981.7466 2994.5764 3005.6382 3062.7012 3091.4074 3104.7790 3127.5764 3144.9887 3157.8031 3170.3762 3177.6802 3537.1378 3552.3550 3570.8585 3699.1962
redmass: 5.3406 5.0994 4.0727 6.2303 5.3981 2.8337 5.0004 4.2655 2.8329 3.9103 5.8822 6.4528 6.6560 5.2918 4.8277 5.3492 1.2489 6.3902 5.6469 5.4295 7.0693 3.6074 4.3562 2.9538 4.2166 8.4671 1.5472 1.8272 3.0920 2.0310 3.5278 6.9422 2.9355 1.1380 5.1668 1.9705 7.1270 2.2988 5.6277 5.8433 7.6147 5.0610 3.4103 5.4533 2.7824 3.0148 1.1150 5.6117 1.3879 1.7912 3.1076 4.0188 3.9783 1.3584 4.8277 1.4483 2.9689 3.1471 2.0703 2.9540 3.1385 2.6848 3.7636 1.4122 2.2490 1.4682 2.6170 2.9386 1.2039 1.5741 1.3676 2.3777 1.1293 1.8887 1.2873 2.7697 1.7750 2.2244 3.0575 5.7258 1.2793 4.2589 3.6119 1.0405 2.2968 1.1026 1.5688 2.9232 1.1671 1.5806 2.3373 4.6538 2.3552 4.0381 6.5125 3.4303 3.5775 9.2183 1.0710 1.0885 1.0358 1.0581 1.1067 1.0985 1.1024 1.0923 1.0878 1.0881 1.0960 1.0970 1.0433 1.0759 1.0770 1.1057
irintensity: 0.0554 0.1195 0.7134 0.0858 0.0361 1.8563 1.5088 2.1132 0.0691 5.3192 3.5348 4.0866 2.5797 7.8268 0.7564 11.7415 1.8266 1.3976 6.0943 1.8936 9.7896 16.9299 5.6344 0.6129 8.0984 23.6850 114.2097 26.3230 55.4542 79.7063 40.3609 7.4158 43.3452 22.1638 4.4476 4.0970 1.1103 57.8247 6.2469 1.7039 25.5096 36.9386 6.6054 9.0949 15.8626 101.7859 7.2722 14.1673 18.9963 24.6208 24.5549 1.1044 16.7458 0.5619 217.8268 15.3192 28.9342 27.9895 7.5077 288.5577 51.0195 110.9250 467.7210 13.4662 32.5312 4.8216 300.5482 38.8793 5.0392 1.6088 47.2259 114.8240 0.0474 5.5402 4.2265 58.8044 15.8061 41.2509 14.7633 113.3119 25.9435 29.3883 77.7067 11.7439 358.7305 21.7269 56.3859 10.3687 59.4576 68.0506 1285.9210 19.3908 81.2372 13.0613 89.8937 732.0081 266.1256 287.3353 93.6017 42.9871 28.5744 30.8094 10.2953 35.8444 48.3213 21.3458 11.3323 1.1616 9.3790 4.4267 73.1620 46.7815 26.8201 60.7289
temp: 298.150 k
press: 1.00000 atm
elementType: 17 8 8 7 7 7 7 7 6 6 6 6 6 6 6 6 6 6 6 6 6 6 6 6 1 1 1 1 1 1 1 1 1 1 1 1 1 1 1 1
symmnumber: 1
zpe: 797521.8 jmol-1
zpe.correction: 0.303760 hartree
zpe.thermalcorrener: 0.326244 hartree
zpe.thermalcorrenthalpy: 0.327188 hartree
zpe.thermalcorrgfe: 0.248571 hartree
zpe.sumelectzpe: -1501.883198 hartree
zpe.sumelectthermal: -1501.860714 hartree
zpe.sumelectthermalent: -1501.859770 hartree
zpe.sumelectthermalfe: -1501.938387 hartree
dipole: 1.4121 4.9593 0.0236
dipole: 5.1565
quadrupole: -148.4217 -124.7060 -151.4430
quadrupole: 5.7608 -2.0989 0.5858
quadrupole: -6.8981 16.8175 -9.9194 5.7608 -2.0989 0.5858
hfenergy: -1502.1869576 hartree
pointgroup: C01 [X(C16H16Cl1N5O2)]
dipole: -0.5321318 1.9559221 -0.0828956 debye
polarizability: 573.2613551|6.2165758|225.1305884|-1.5182542|-5.7902425|101.5469579 unknown
InChI: InChI=1S/C16H16ClN5O2/c1-2-24-16(23)22-13-7-11-14(15(18)21-13)20-12(8-19-11)9-3-5-10(17)6-4-9/h3-7,19,22H,2,8,18H2,1H3
charge 0 multiplicity 1
40 atoms
Cl 8.288858 -0.850527 0.112439
O  -6.312755 0.333869 0.075726
O  -5.09944 -1.68659 0.005564
N  0.483822 2.23035 0.010211
N  1.43638 -0.420478 -0.031768
N  -2.234069 -1.019926 -0.054866
N  -4.072954 0.481862 0.04023
N  -0.434445 -2.510288 -0.129678
C  1.921247 2.034626 -0.254578
C  -0.44062 1.199831 -0.025938
C  2.325794 0.558793 -0.08061
C  0.067889 -0.137547 -0.070408
C  3.766519 0.238242 -0.030084
C  -1.838702 1.409119 0.018393
C  -0.879826 -1.21359 -0.085026
C  -2.677775 0.258772 0.000951
C  4.766516 1.237965 -0.209886
C  4.193578 -1.104706 0.193128
C  6.140272 0.914373 -0.169968
C  5.557343 -1.441523 0.237154
C  6.517115 -0.422052 0.054278
C  -5.120598 -0.441716 0.035882
C  -7.571404 -0.45906 0.083602
C  -8.723083 0.541614 0.096241
H  2.505517 2.664694 0.445276
H  2.192686 2.364361 -1.285927
H  0.144224 3.188277 0.087866
H  -2.260269 2.419514 0.060177
H  4.49061 2.281244 -0.393718
H  3.427236 -1.871975 0.333522
H  -4.382562 1.455181 0.073946
H  6.900831 1.687628 -0.311777
H  5.874754 -2.473346 0.413096
H  0.568787 -2.682279 -0.137325
H  -1.117715 -3.263465 -0.121824
H  -7.585978 -1.106422 -0.812244
H  -7.571193 -1.111048 0.976391
H  -9.687303 0.00134 0.104164
H  -8.67828 1.184231 0.99238
H  -8.694509 1.187353 -0.798294
