program: Gaussian 09
title: 000100244
version: EM64L-G09RevD.01
frameworkgroup: C1[X(C6H8N4O4)]
method: RPBEPBE
basis: SDD
operation: Freq
keyword: #pfreq=noraman
keyword: PBEPBE/SDD
title: #p freq=noraman PBEPBE/SDD
converged: YES YES NO NO
title: Mulliken charges:
elementType: O O O O N N N N C C C C C C H H H H H H H H
charge: -0.440160 -0.289314 -0.243956 -0.152696 -0.077931 -0.006351 0.070638 -0.629215 -0.346253 0.062662 -0.191824 0.056591 -0.297973 0.184142 0.278708 0.232253 0.312562 0.214653 0.204996 0.359726 0.368705 0.330037
chargesum: 0.00000
title: Mulliken charges with hydrogens summed into heavy atoms:
elementType: O O O O N N N N C C C C C C
charge: -0.080434 -0.289314 -0.243956 -0.152696 -0.077931 -0.006351 0.070638 0.069527 0.164708 0.062662 0.120738 0.056591 0.121676 0.184142
polarizability: 1.45593523e+02 3.75217768e+00 1.25214010e+02 -1.37878577e+01 -3.62394533e-01 6.18521709e+01
1716.lowfreq: -8.0699 -5.2103 -0.0006 0.0005 0.0006 2.4775 15.8984 27.0089 58.0261
frequency: 15.5800 26.9288 58.0156 81.4355 132.1862 165.4454 183.6199 224.6091 235.4785 268.5016 307.5700 323.0499 372.5303 402.9103 423.2563 514.5226 565.7438 607.5495 616.9708 633.0799 641.5893 697.3575 714.9800 746.0039 776.3480 778.0553 854.7291 861.4450 945.0210 1000.7520 1037.0744 1049.0978 1071.0903 1106.6856 1124.5164 1157.3149 1204.4306 1217.4026 1253.9035 1294.7040 1313.6939 1326.2963 1359.2727 1381.7089 1396.1215 1412.4526 1419.5633 1461.0793 1478.0400 1522.5193 1583.7046 1622.7105 2948.5751 2997.0223 3024.0168 3114.5127 3245.3386 3375.4485 3584.5252 3626.9954
redmass: 5.0696 11.3174 6.7159 7.6180 3.5160 4.9796 7.3763 4.9825 2.0140 1.6497 6.3670 3.7718 11.7073 3.4038 4.3755 3.5799 2.4557 3.7911 5.9035 3.1723 2.2924 4.3308 8.1102 4.4345 1.0997 8.4145 2.0839 1.8726 2.5400 3.6541 3.3210 1.9586 6.0282 1.9337 1.6221 1.7700 1.1418 3.5090 1.7025 4.4687 2.0692 4.4545 2.0821 6.7077 2.9362 1.5392 2.9606 1.3173 1.0856 6.1220 1.7870 2.6236 1.0558 1.1047 1.0665 1.0990 1.1005 1.0582 1.0668 1.0942
irintensity: 1.4473 2.2323 0.9062 6.5466 20.0147 4.3390 0.8687 36.8749 28.4455 133.0781 1.2610 0.7422 5.2748 6.6020 11.0646 6.1832 63.6853 2.3601 3.9499 34.2820 16.6593 18.6791 45.3718 20.8087 158.2789 32.6336 45.3538 0.5748 9.0796 11.9037 53.7239 5.9103 14.0500 8.9085 32.1958 68.1863 27.6487 139.1996 39.1357 62.6499 35.8682 32.5410 44.7168 238.9241 15.5203 9.6427 34.5664 6.9526 12.4120 29.2138 143.6637 273.5522 56.7963 50.7182 38.8965 1.7067 4.5630 205.8885 9.4049 113.8204
temp: 298.150 k
press: 1.00000 atm
elementType: 8 8 8 8 7 7 7 7 6 6 6 6 6 6 1 1 1 1 1 1 1 1
symmnumber: 1
zpe: 412024.3 jmol-1
zpe.correction: 0.156932 hartree
zpe.thermalcorrener: 0.170222 hartree
zpe.thermalcorrenthalpy: 0.171166 hartree
zpe.thermalcorrgfe: 0.114450 hartree
zpe.sumelectzpe: -752.184501 hartree
zpe.sumelectthermal: -752.171210 hartree
zpe.sumelectthermalent: -752.170266 hartree
zpe.sumelectthermalfe: -752.226982 hartree
dipole: 5.4492 2.6038 -0.7939
dipole: 6.0913
quadrupole: -56.6909 -102.1868 -77.0641
quadrupole: 1.4225 -2.1806 3.7388
quadrupole: 21.9564 -23.5396 1.5832 1.4225 -2.1806 3.7388
hfenergy: -752.3414323 hartree
pointgroup: C01 [X(C6H8N4O4)]
dipole: -2.1086817 -1.0474149 0.4467634 debye
dipolederiv: -0.5105912 0.1146595 -0.1279843 0.2056404 -0.4991379 -0.3033774 -0.0479985 -0.2481969 -0.5558848 -0.6268447 0.0070799 -0.0220803 -0.0688779 -0.9694805 0.2449305 0.004734 0.259898 -0.4912584 -0.9469703 0.0977094 -0.1134329 0.0765432 -0.5368584 0.1471122 -0.1159026 0.1496709 -0.3466529 -0.4158948 -0.0070023 -0.0185302 -0.0487744 -0.756804 0.2909271 -0.0069476 0.2905072 -0.3396525 -0.4993241 -0.1112614 0.0214671 -0.1814431 -0.2668873 0.1077744 0.0968358 0.0993352 -0.1377395 0.0927768 0.4635335 -0.1899522 0.3338139 -0.2015314 0.043047 -0.1337332 0.0872844 -0.1825559 1.4755401 0.2490412 0.0060722 0.3359475 1.2396571 -0.5006755 -0.0142796 -0.4923046 0.4756591 -1.0615159 -0.2277767 0.0704381 -0.0441323 -0.6007706 -0.0257337 -0.0224469 -0.0444443 -0.6314233 0.6944637 0.0451399 0.0481499 -0.0529049 0.1100477 0.0942353 0.0695182 0.0407316 0.1350693 -0.3126024 0.1158394 -0.0671356 0.2891086 -0.1008701 0.0646265 -0.1629458 0.04972 -0.0333435 0.0513891 -0.1447266 0.0708404 -0.1210132 0.0391224 -0.0550669 0.0422107 -0.0785907 -0.0411163 -0.5040715 -0.4142803 0.1639039 -0.3354625 -0.0407751 0.0438023 0.0916512 0.021633 0.0675947 0.3200164 -0.0387647 0.0492864 -0.0698481 0.4578515 0.2276121 -0.007823 0.2207926 0.5159748 1.4637349 0.0403954 0.0891707 -0.0055554 1.1676072 -0.392988 0.1307253 -0.4022637 0.4297934 0.0592105 -0.0256575 0.023401 0.0419145 0.0145323 0.0564696 -0.0160862 0.0329796 0.1057649 -0.0630027 -0.0200957 -0.0043848 -0.0645607 0.0252502 -0.1255054 -0.0408188 -0.079674 -0.0056386 0.1248533 -0.0496781 0.0092125 -0.0542525 0.121002 0.0387023 0.0154694 0.0407462 0.1755853 -0.2321423 -0.0582154 -0.0752794 -0.0019587 0.0356237 -0.0567111 -0.0318939 -0.0563131 -0.0005801 0.0713582 0.0945214 -0.0488504 0.0634331 -0.1852357 0.0007123 -0.0174477 0.0322675 -0.0202492 0.3145784 -0.0797143 0.1215963 -0.1328731 0.2732914 0.0867849 0.1174167 0.0508387 0.1374825 0.2698101 -0.049911 0.0087331 -0.159081 0.4972634 -0.0739594 0.062081 -0.06248 0.4105698 0.2352283 -0.0008359 -0.0146414 -0.0056633 0.1771021 0.0872807 -0.0123185 0.0878621 0.3326009 unknown
polarizability: 147.1958241|6.0237011|113.0732546|1.1001869|-25.9111828|72.3906257 unknown
InChI: InChI=1S/C6H8N4O4/c7-5(12)4-3-9(1-2-11)8-6(4)10(13)14/h3,11H,1-2,7H2
charge 0 multiplicity 1
22 atoms
O  -3.48548 0.431538 1.538214
O  1.220126 -3.085651 0.94635
O  2.755977 0.949396 -0.708666
O  1.200944 2.342608 -1.60174
N  -1.562878 -0.392071 -0.524738
N  -0.808919 0.675086 -0.951748
N  1.523609 1.252599 -1.0129
N  2.903375 -1.557534 0.442394
C  -3.027892 -0.339088 -0.687584
C  0.550197 -1.008818 -0.048085
C  -0.796385 -1.40398 0.011058
C  0.478045 0.298078 -0.661085
C  -3.781543 -0.655573 0.607182
C  1.594154 -1.958732 0.483193
H  -3.262081 0.685241 -1.016244
H  -3.332331 -1.049095 -1.478637
H  -1.188947 -2.338425 0.403216
H  -4.863648 -0.707868 0.362529
H  -3.470922 -1.642236 1.012701
H  -3.873103 0.239759 2.427903
H  3.150688 -0.634328 0.061913
H  3.608914 -2.198904 0.802575
