program: Gaussian 09
title: 000100271
version: EM64L-G09RevD.01
frameworkgroup: C1[X(C17H21N5O3)]
method: RPBEPBE
basis: SDD
operation: Freq
keyword: #p
keyword: freq=noraman
keyword: PBEPBE/SDD
title: #p freq=noraman PBEPBE/SDD
converged: YES YES NO NO
title: Mulliken charges:
elementType: O O O N N N N N C C C C C C C C C C C C C C C C C H H H H H H H H H H H H H H H H H H H H H
charge: -0.393273 -0.293412 -0.270906 -0.124306 -0.175164 -0.213152 -0.215135 -0.667084 -0.460629 -0.346596 -0.374674 -0.444467 0.249645 0.450638 -0.075473 0.328595 -0.361108 -0.379910 0.188454 0.232738 -0.232859 -0.229568 -0.662903 -0.271749 -0.603571 0.286856 0.231988 0.288925 0.223108 0.233176 0.226123 0.221676 0.232448 0.240450 0.214260 0.217410 0.217348 0.240864 0.299605 0.239893 0.224671 0.273118 0.246700 0.247854 0.404011 0.335384
chargesum: 0.00000
title: Mulliken charges with hydrogens summed into heavy atoms:
elementType: O O O N N N N N C C C C C C C C C C C C C C C C C
charge: -0.393273 -0.293412 -0.270906 -0.124306 -0.175164 -0.213152 -0.215135 0.072310 0.058215 0.165437 0.084625 0.009657 0.249645 0.450638 -0.075473 0.328595 -0.120658 -0.165650 0.188454 0.232738 -0.015449 -0.012220 0.117460 -0.047077 0.164102
polarizability: 3.07139711e+02 7.14405010e-01 2.35008275e+02 -2.09710439e+00 -8.59984877e+00 1.74063897e+02
1716.lowfreq: -10.1790 -4.6617 -0.0010 -0.0009 -0.0008 2.4362 11.8508 27.9845 43.4811
frequency: 11.8230 27.6706 43.4687 49.9765 65.7645 90.4085 98.2802 103.0334 122.5174 142.0678 163.8159 171.8877 188.8938 211.8602 226.2885 227.7211 243.5097 282.0616 291.7993 307.7998 319.2291 342.6932 367.6550 392.1916 394.4575 411.1225 415.3442 428.0751 446.4427 456.0479 468.5465 502.1734 507.0567 508.9738 534.2490 610.2125 614.4809 629.2285 654.5606 659.9672 670.2230 689.4794 710.6158 716.0924 722.6671 751.9229 771.7260 786.7103 807.5833 856.3546 864.6738 899.0314 914.1215 925.0706 930.7034 953.3052 971.8653 975.1388 977.1842 991.0046 1022.9707 1031.6545 1044.3531 1061.2724 1069.1725 1090.3863 1092.9394 1125.3719 1130.8800 1148.5615 1166.9174 1171.7385 1199.7790 1203.4238 1209.2525 1213.3462 1224.6776 1237.8783 1244.2009 1254.8936 1264.3242 1285.4501 1331.6263 1337.9503 1343.4936 1348.2262 1356.5803 1363.2985 1375.2154 1383.7287 1390.2953 1415.9677 1425.5822 1428.8180 1449.1340 1462.9552 1475.0634 1479.0384 1481.6650 1485.0253 1487.4529 1493.4047 1500.9233 1502.6243 1514.5535 1552.8849 1576.1384 1595.4164 1608.7150 1621.8401 1637.7813 2926.5389 2938.3513 2979.1399 2983.0102 2987.0288 3011.7089 3012.1445 3048.3668 3068.7939 3069.8753 3076.2844 3102.3217 3109.0194 3120.7140 3124.5388 3127.1619 3142.7029 3151.6726 3158.6629 3169.5501 3639.3213
redmass: 5.2666 4.7079 3.9226 5.5471 4.7374 2.4962 1.6052 2.6212 3.7898 4.2931 3.8510 3.7810 3.8227 3.3157 3.0607 1.2994 5.1992 3.0153 4.6350 4.2834 3.1815 4.9866 2.5875 4.7394 4.2474 3.1660 5.1162 3.6512 4.7557 3.4735 1.5077 3.3582 4.7088 3.3629 5.3620 3.5517 5.9632 5.3044 5.7559 5.6993 6.3057 1.8154 6.7795 3.5210 6.0154 1.8943 8.6833 4.7779 1.2985 1.5314 1.6076 2.7650 1.1864 3.5876 3.4315 1.3693 1.4166 5.0933 2.0624 2.3889 2.3344 2.1097 2.7718 2.1641 1.9310 1.7828 1.7983 1.2974 1.3053 1.8157 3.1007 1.0641 1.4214 1.9394 2.4274 1.5627 1.9395 3.1321 2.0507 2.3442 1.8147 1.6973 1.4095 1.9015 2.2358 1.5721 1.7849 1.5387 2.1036 2.3294 2.6346 1.3858 2.2118 1.4665 2.5877 1.1430 1.0707 1.0543 1.1267 1.2044 1.0945 1.1069 1.0446 2.0953 3.9910 5.1651 5.9516 3.2465 3.4816 6.0829 6.0490 1.0715 1.0584 1.0998 1.0358 1.0599 1.0362 1.0688 1.1016 1.1034 1.0901 1.0716 1.1024 1.0964 1.0844 1.0970 1.0887 1.1015 1.0916 1.0938 1.0995 1.0839
irintensity: 0.5074 0.2310 0.6834 1.5283 1.7802 3.5873 2.8541 7.8360 0.6689 5.0029 3.1912 10.9138 0.6132 0.7284 1.3543 1.8289 3.6670 1.1598 1.1797 7.8209 4.8385 5.0794 4.0795 8.3868 16.8619 4.6695 16.4813 12.6020 12.5254 31.6750 73.5549 14.1753 19.3563 23.5790 12.7612 19.1375 1.6233 18.7142 2.3704 4.7112 3.3401 43.1398 5.8985 0.7576 5.0625 86.0274 8.4788 3.0839 0.1030 7.8126 3.5935 5.9513 168.9893 20.2931 27.5580 0.0304 0.0511 8.4540 2.9928 66.2757 50.8335 16.6392 6.6064 15.9907 1.1548 30.3598 30.4620 0.1795 0.1746 6.2853 30.0475 0.0180 20.2853 26.7609 5.2852 28.7730 29.3927 26.2315 14.6592 0.6362 43.3213 102.2899 5.0528 24.3885 141.2727 18.3017 61.8622 12.8285 142.1085 37.4857 7.4546 0.9716 361.3500 241.1849 0.1508 20.2084 6.5620 23.7565 146.6671 89.1520 38.0148 10.9448 18.9509 107.0748 260.4456 284.1392 14.1659 191.9181 767.9772 224.3600 373.8502 74.3963 44.5481 12.1655 39.9130 17.9984 41.7892 68.9986 12.7571 21.9351 9.6493 387.2545 18.1151 3.7769 10.2893 1.8855 12.5229 0.9939 42.2585 36.6953 4.8386 78.8562
temp: 298.150 k
press: 1.00000 atm
elementType: 8 8 8 7 7 7 7 7 6 6 6 6 6 6 6 6 6 6 6 6 6 6 6 6 6 1 1 1 1 1 1 1 1 1 1 1 1 1 1 1 1 1 1 1 1 1
symmnumber: 1
zpe: 971873.6 jmol-1
zpe.correction: 0.370167 hartree
zpe.thermalcorrener: 0.393049 hartree
zpe.thermalcorrenthalpy: 0.393993 hartree
zpe.thermalcorrgfe: 0.316613 hartree
zpe.sumelectzpe: -1158.047275 hartree
zpe.sumelectthermal: -1158.024393 hartree
zpe.sumelectthermalent: -1158.023449 hartree
zpe.sumelectthermalfe: -1158.100829 hartree
dipole: -1.2215 -2.3658 1.7379
dipole: 3.1795
quadrupole: -153.6202 -135.1660 -152.3801
quadrupole: 14.5045 -7.6309 -8.7712
quadrupole: -6.5648 11.8894 -5.3247 14.5045 -7.6309 -8.7712
hfenergy: -1158.4174417 hartree
pointgroup: C01 [X(C17H21N5O3)]
dipole: 0.4033011 -0.6606352 -0.9826973 debye
polarizability: 306.2730685|0.5960951|223.0698045|-10.2729288|25.7345004|186.8690105 unknown
InChI: InChI=1S/C17H21N5O3/c1-19-14(18)13(15(23)20(2)17(19)25)16(24)22-10-8-21(9-11-22)12-6-4-3-5-7-12/h3-7H,8-11,18H2,1-2H3
charge 0 multiplicity 1
46 atoms
O  0.943716 -2.70232 0.258605
O  2.195536 0.961904 1.883625
O  5.225563 1.623342 -1.610356
N  -0.14815 -0.829145 1.063481
N  -2.855397 -0.070281 0.564594
N  3.894819 -0.309826 -1.641298
N  3.681799 1.295079 0.112059
N  2.610606 -2.294958 -1.64821
C  -1.251317 -1.705047 1.51586
C  -0.479113 0.617705 1.006663
C  -2.488273 -1.502932 0.622706
C  -1.97947 0.861204 1.29167
C  0.956081 -1.416518 0.475294
C  -4.096421 0.311756 0.027174
C  2.113012 -0.595897 0.020303
C  2.867741 -1.079259 -1.09113
C  -4.873598 -0.626235 -0.725812
C  -4.634097 1.626808 0.199434
C  2.607205 0.559607 0.749075
C  4.31298 0.931896 -1.074369
C  -6.111253 -0.255089 -1.28822
C  -5.871375 1.982423 -0.37453
C  4.623589 -0.771868 -2.839943
C  -6.625552 1.051735 -1.126057
C  4.184201 2.523565 0.769022
H  -0.907025 -2.747426 1.445593
H  -1.487513 -1.475719 2.571807
H  0.128365 1.175757 1.74067
H  -0.222716 0.996244 -0.001651
H  -2.266184 -1.893943 -0.391978
H  -3.330589 -2.100686 1.032029
H  -2.16664 0.826268 2.387597
H  -2.190814 1.893415 0.968471
H  -4.504564 -1.642854 -0.888674
H  -4.105976 2.373037 0.800641
H  -6.676383 -0.998154 -1.863523
H  -6.253717 2.99848 -0.21993
H  5.161671 -1.716169 -2.636848
H  5.356798 0.008558 -3.09021
H  3.935528 -0.902179 -3.694792
H  -7.587558 1.334716 -1.56521
H  3.604814 2.65474 1.693709
H  4.055603 3.389637 0.099182
H  5.257062 2.418829 0.999764
H  1.944005 -2.872682 -1.081219
H  3.0973 -2.635716 -2.472368
