program: Gaussian 09
title: 000100248
version: EM64L-G09RevD.01
frameworkgroup: C1[X(C19H19NO4)]
method: RPBEPBE
basis: SDD
operation: Freq
keyword: #p
keyword: freq=noraman
keyword: PBEPBE/SDD
title: #p freq=noraman PBEPBE/SDD
converged: YES YES NO NO
title: Mulliken charges:
elementType: O O O O N C C C C C C C C C C C C C C C C C C C H H H H H H H H H H H H H H H H H H H
charge: -0.295173 -0.297245 -0.331008 -0.435585 -0.015732 0.194197 0.015490 -0.646796 0.527893 0.578320 -0.533687 -0.591210 0.186051 -0.349098 0.222300 -0.465408 -0.472446 -0.394684 0.204956 -0.328559 0.120764 -0.529434 -0.529005 -0.526596 0.230838 0.229690 0.269828 0.259445 0.238527 0.248916 0.226895 0.239691 0.245960 0.254285 0.233385 0.226021 0.232959 0.225365 0.257438 0.376890 0.223165 0.233337 0.239057
chargesum: 0.00000
title: Mulliken charges with hydrogens summed into heavy atoms:
elementType: O O O O N C C C C C C C C C C C C C C C C C C C
charge: -0.295173 -0.297245 -0.331008 -0.058695 -0.015732 0.194197 0.015490 -0.186268 0.527893 0.578320 -0.263859 -0.331765 0.186051 -0.110571 0.222300 -0.216492 -0.245551 -0.154993 0.204956 -0.082599 0.120764 0.184258 0.186757 0.168964
polarizability: 3.55453420e+02 2.24052522e+01 2.26480417e+02 -1.51073228e+01 -1.04371793e+00 1.41037385e+02
1716.lowfreq: -10.8353 -4.7871 -0.8077 -0.0006 -0.0001 0.0007 5.2546 16.5942 42.6961
frequency: 4.1362 15.9106 42.6741 57.6810 67.3447 85.0354 99.9911 111.2441 132.5564 140.3618 156.2575 160.5611 175.2553 189.3951 196.4336 213.5015 232.1215 260.6512 272.8667 285.5979 305.3612 338.8186 342.9336 351.7622 375.3195 414.8259 429.4634 440.9230 481.0658 492.0593 495.2836 532.8846 539.2080 551.3689 565.4697 579.1380 592.4947 634.7703 671.6873 704.5895 707.6583 728.4009 739.4825 761.0931 776.2758 784.8804 816.3922 830.3940 847.8389 855.0386 889.7865 896.5285 906.9298 915.0128 927.3222 946.5235 951.1691 967.7124 994.5019 1011.7645 1067.0084 1100.6606 1111.3494 1114.7515 1115.0873 1117.1687 1141.2512 1149.2494 1155.5855 1159.0976 1181.0247 1188.6136 1192.9817 1217.9923 1231.2165 1236.4646 1251.3062 1269.5023 1279.1361 1313.5931 1333.1584 1367.5832 1377.9442 1405.5294 1417.0694 1421.4034 1424.9609 1435.6966 1446.5167 1447.7589 1458.1950 1459.2190 1462.3002 1463.5747 1475.8333 1477.3174 1484.8526 1486.9278 1508.2707 1549.3498 1570.4037 1613.6561 1625.7377 1627.2343 2945.5732 2964.9279 2974.9988 2976.4958 3015.5884 3054.4372 3073.4916 3074.8290 3124.2374 3126.0012 3126.3132 3127.8113 3129.8542 3151.4181 3155.6152 3165.6032 3167.4849 3170.3054 3512.8083
redmass: 5.2898 4.2857 5.8269 4.1605 3.5734 3.3522 3.8166 3.4196 4.2199 4.2385 1.1153 4.3005 1.0960 2.7983 1.7234 4.0479 4.0119 2.0144 3.4079 5.7657 6.0361 4.6540 3.6070 4.9008 4.3809 5.3658 6.7022 3.0659 3.6584 2.2255 1.5666 4.4487 3.7479 5.2260 4.5350 6.1719 4.8692 5.6451 5.7036 5.8334 4.8478 4.2586 3.8321 3.9172 3.5370 3.6632 1.5311 1.3139 1.7693 4.1971 1.8813 3.5521 1.7474 3.3683 1.5507 2.4665 4.8115 1.4552 4.5532 3.9203 2.4939 3.1669 1.2863 2.0301 1.2692 1.2565 1.7783 1.3595 1.4826 1.6165 1.6827 1.3878 1.1433 1.7713 1.9478 1.5663 2.0045 2.7673 2.9332 1.8550 2.6370 3.1441 4.3351 3.0112 3.5789 1.3563 2.0356 1.3307 1.8513 1.5646 1.0748 1.2649 1.1062 1.0504 1.0955 1.0559 2.0677 1.3825 3.1702 7.7399 6.1264 6.6225 6.8924 7.2351 1.0661 1.0324 1.0308 1.0309 1.0912 1.1042 1.1040 1.1043 1.1003 1.1030 1.1030 1.0896 1.0868 1.0927 1.0982 1.0916 1.0912 1.0948 1.0645
irintensity: 0.3098 1.1802 0.8553 0.7645 2.4030 5.2906 2.5239 7.6218 3.4418 1.7908 0.4044 1.7805 0.2666 1.7199 0.1354 8.1127 6.7814 0.0652 5.6444 7.9531 4.3235 5.8690 3.6327 1.2852 0.9199 5.2906 6.1915 11.2859 8.3552 42.0349 92.9142 16.5203 0.9029 21.5966 5.0176 7.5752 8.5896 17.0696 2.0869 1.3494 13.8626 8.6329 4.5538 22.9637 17.3417 10.7009 24.3893 11.4117 8.7707 9.0730 7.5888 5.2290 53.4399 39.1415 0.8984 15.2727 107.5624 1.0468 1.9631 58.1224 7.5367 87.2041 24.4124 44.3894 2.5242 0.2191 20.9471 2.5909 19.9624 32.4519 35.6752 245.4684 7.2971 27.2884 68.8536 25.5242 6.5698 24.1154 209.5469 41.2786 7.0392 18.3193 55.5710 10.7596 10.5847 3.4282 39.9202 11.6894 87.2095 13.6374 19.6232 25.5319 2.5090 15.1263 74.2190 6.3293 40.4950 110.6510 142.7133 30.8426 7.5377 11.4282 14.0792 12.4210 22.4337 53.5526 83.4153 71.1081 11.0120 41.5113 30.0817 18.1572 31.5811 21.1967 24.5945 12.2181 4.4185 3.3197 40.7512 11.8004 2.0620 3.7589 81.6292
temp: 298.150 k
press: 1.00000 atm
elementType: 8 8 8 8 7 6 6 6 6 6 6 6 6 6 6 6 6 6 6 6 6 6 6 6 1 1 1 1 1 1 1 1 1 1 1 1 1 1 1 1 1 1 1
symmnumber: 1
zpe: 885027.5 jmol-1
zpe.correction: 0.337089 hartree
zpe.thermalcorrener: 0.359896 hartree
zpe.thermalcorrenthalpy: 0.360840 hartree
zpe.thermalcorrgfe: 0.282072 hartree
zpe.sumelectzpe: -1089.288764 hartree
zpe.sumelectthermal: -1089.265957 hartree
zpe.sumelectthermalent: -1089.265013 hartree
zpe.sumelectthermalfe: -1089.343781 hartree
dipole: -4.8308 1.9084 2.2666
dipole: 5.6671
quadrupole: -133.8600 -126.6023 -139.9891
quadrupole: 17.7452 6.7577 5.7042
quadrupole: -0.3762 6.8815 -6.5053 17.7452 6.7577 5.7042
hfenergy: -1089.6258527 hartree
pointgroup: C01 [X(C19H19N1O4)]
dipole: -1.8978939 -0.5750896 -1.0190342 debye
polarizability: 354.5350344|-26.3353472|225.3181792|13.6902049|11.9709518|143.1180081 unknown
InChI: InChI=1S/C19H19NO4/c1-22-17-9-12(4-5-16(17)21)8-15-14-11-19(24-3)18(23-2)10-13(14)6-7-20-15/h4-7,9-11,21H,8H2,1-3H3
charge 0 multiplicity 1
43 atoms
O  -4.216367 2.026708 -0.563599
O  -5.664173 -0.446066 -0.024817
O  5.556327 -0.803905 -0.995973
O  6.533525 0.910745 0.807883
N  0.733496 -1.50621 0.430809
C  -1.395411 -0.339771 0.095069
C  0.055729 -0.376747 0.142543
C  0.850355 0.899828 -0.159146
C  -2.122531 -1.557277 0.392617
C  2.346317 0.868572 0.111256
C  -2.141536 0.842723 -0.213505
C  -3.551484 -1.556089 0.333824
C  -3.536219 0.830812 -0.2420
C  -1.367314 -2.732477 0.710775
C  -4.254711 -0.398604 0.003759
C  3.202527 -0.006293 -0.609363
C  2.915125 1.75156 1.058319
C  0.023823 -2.660905 0.710607
C  4.585457 0.013132 -0.369266
C  4.310376 1.775073 1.2998
C  5.150394 0.906657 0.585889
C  -5.067949 2.566165 0.525781
C  -6.275958 -0.144333 -1.343002
C  5.080624 -1.801004 -1.953946
H  0.406512 1.728121 0.426083
H  0.664375 1.160983 -1.223854
H  -1.641434 1.791985 -0.423179
H  -4.115335 -2.473965 0.531007
H  -1.878556 -3.672312 0.944065
H  2.767388 -0.71251 -1.32121
H  2.266141 2.431624 1.622453
H  0.636839 -3.538935 0.941393
H  4.753833 2.455046 2.032945
H  -5.821922 1.823658 0.842835
H  -5.555221 3.456595 0.101048
H  -4.437666 2.855756 1.387538
H  -7.36234 -0.165393 -1.170179
H  -5.994871 -0.925732 -2.073762
H  -5.958179 0.847599 -1.709942
H  6.940768 0.221547 0.218225
H  4.591441 -1.316115 -2.820773
H  4.373363 -2.503983 -1.473899
H  5.978743 -2.341364 -2.288108
