program: Gaussian 09
title: 000100256
version: EM64L-G09RevD.01
frameworkgroup: C1[X(C22H28N4O2)]
method: RPBEPBE
basis: SDD
operation: Freq
keyword: #p
keyword: freq=noraman
keyword: PBEPBE/SDD
title: #p freq=noraman PBEPBE/SDD
converged: YES YES NO NO
title: Mulliken charges:
elementType: O O N N N N C C C C C C C C C C C C C C C C C C C C C C H H H H H H H H H H H H H H H H H H H H H H H H H H H H
charge: -0.329812 -0.329879 -0.407512 -0.407542 -0.284999 -0.285003 0.120079 0.119843 0.258759 0.258812 -0.163682 -0.163575 0.288297 0.288360 -0.370373 -0.370394 -0.371752 -0.371760 -0.409170 -0.409155 -0.396022 -0.396033 -0.232943 -0.232944 -0.324009 -0.324008 -0.688865 -0.688867 0.250450 0.250447 0.384110 0.384145 0.236669 0.201964 0.236648 0.201967 0.199173 0.225013 0.199184 0.225002 0.290893 0.290888 0.232515 0.232514 0.243244 0.243244 0.183095 0.214772 0.183095 0.214770 0.232249 0.202883 0.215041 0.202884 0.215040 0.232248
chargesum: 0.00000
title: Mulliken charges with hydrogens summed into heavy atoms:
elementType: O O N N N N C C C C C C C C C C C C C C C C C C C C C C
charge: -0.329812 -0.329879 -0.023402 -0.023397 -0.041756 -0.041759 0.120079 0.119843 0.258759 0.258812 -0.163682 -0.163575 0.288297 0.288360 -0.119923 -0.119946 0.066880 0.066855 0.015016 0.015031 -0.105128 -0.105145 -0.000428 -0.000430 0.073858 0.073856 -0.038691 -0.038695
polarizability: 4.08519185e+02 6.74572632e-03 4.44788562e+02 -2.28054633e+00 7.69987736e-03 1.45760577e+02
1716.lowfreq: -3.9771 -1.4848 -0.0011 0.0002 0.0014 4.3181 16.0739 22.8096 30.4120
frequency: 16.0564 22.8063 30.4006 35.2595 41.0187 45.0909 60.3910 66.3092 76.7136 101.2359 117.1334 118.6491 125.6256 133.4708 147.7025 155.6578 169.2935 186.2560 190.3124 197.4342 220.0753 231.4487 251.0356 251.0893 281.8403 293.4512 330.9598 357.6805 370.5759 390.7528 407.3941 425.4596 426.8968 428.3125 429.2884 466.1422 473.4321 499.1237 506.4622 524.3168 563.0357 600.0404 623.4420 659.2830 663.5791 671.8412 683.0670 705.5637 722.9925 730.1792 770.3209 800.7780 803.8194 805.1704 811.6663 819.3435 827.7815 847.6410 849.2695 852.2547 852.4407 878.4439 902.7406 903.2942 928.2894 943.8351 954.7416 995.2013 1010.7573 1013.0713 1036.3165 1038.3625 1040.4432 1053.9231 1058.0948 1081.8153 1083.3135 1086.2413 1112.1425 1113.2119 1124.0501 1126.5619 1154.5326 1154.6413 1161.6844 1164.2413 1165.0967 1168.2249 1185.3051 1220.6541 1220.8570 1245.0632 1261.6761 1262.2916 1265.5075 1283.9711 1284.0313 1290.7172 1308.3849 1314.5520 1324.1768 1331.5261 1350.4058 1354.7471 1369.7848 1382.5175 1385.2030 1388.2306 1389.7048 1397.6569 1399.2666 1405.6944 1450.2348 1450.6235 1454.5447 1459.7992 1473.2266 1473.2831 1477.9197 1478.7737 1479.8030 1482.8643 1484.0936 1490.9261 1491.4705 1497.6092 1501.3127 1501.3497 1539.0071 1552.3001 1581.3828 1593.0632 1609.6692 1642.7996 2861.4336 2861.5016 2868.8731 2868.9230 2926.7525 2927.4254 2979.6977 2979.7223 2997.4815 2997.5533 3002.6543 3002.6580 3024.8564 3024.9242 3070.7301 3072.3233 3072.3265 3077.9081 3094.3169 3094.3285 3130.5098 3147.5644 3148.6166 3163.4964 3169.6660 3170.7859 3421.4135 3421.4144
redmass: 4.2383 4.4822 4.2285 1.8263 1.7332 4.3545 5.2756 3.8766 3.0345 3.5158 2.7090 1.9791 2.3378 3.5821 3.8594 3.9294 4.6720 4.0261 6.3671 3.6173 5.3545 4.1914 1.1303 1.1354 5.0937 3.9698 4.2102 4.7827 5.5881 8.8135 4.5465 6.0757 3.9558 3.3982 10.9057 7.7723 3.2349 4.0580 4.6753 5.2357 3.0637 5.6511 5.6944 3.2411 4.7757 1.3858 1.7265 6.3042 2.3421 5.4647 5.8314 1.3333 1.4931 1.0951 1.2979 1.1484 1.3892 1.2484 4.9355 2.5306 1.1108 5.1509 1.7499 1.9793 1.8390 4.5580 1.3367 1.3857 1.3532 3.9267 2.8230 3.0997 2.3374 1.8437 1.8032 2.1046 2.1304 2.4030 2.4233 2.1558 2.5863 2.5000 2.3801 2.3080 2.0804 1.1854 1.7667 2.1086 1.5371 1.4138 1.4086 1.6526 1.2619 1.1756 1.7047 1.1091 1.1113 1.7973 1.3306 1.6217 1.8015 3.6044 1.4677 1.4009 8.0020 2.7920 2.5597 1.2636 1.4615 1.4406 1.6444 9.6948 1.2116 1.1818 2.9668 3.4154 1.0584 1.0582 2.2226 1.0741 1.3378 1.0758 1.1355 1.0974 1.0910 5.5488 1.0852 1.0870 4.7734 2.6599 2.1776 4.1694 6.4842 6.1220 1.0716 1.0715 1.0713 1.0713 1.0650 1.0651 1.0376 1.0376 1.0913 1.0911 1.0871 1.0871 1.0926 1.0927 1.0840 1.0978 1.0977 1.0833 1.1003 1.1003 1.0861 1.0862 1.0908 1.0942 1.0967 1.0991 1.0740 1.0740
irintensity: 0.3059 0.1340 0.1722 0.1898 0.6335 0.5463 4.6101 0.0180 3.3776 0.0048 3.0936 1.0894 2.3106 0.6019 1.2926 2.1094 0.1649 2.2689 0.6602 0.7518 2.8492 0.5803 0.0720 2.1199 1.8088 1.6086 1.9680 0.0105 7.1194 0.0297 5.2461 0.0348 2.8912 2.5818 18.7004 17.3301 0.5052 1.6042 0.0404 20.8523 25.7301 1.0869 1.6607 12.9609 0.0445 45.9352 138.2846 5.5473 16.2924 0.0018 0.4336 63.5250 25.0669 0.0613 35.5820 0.2403 25.6144 0.1605 5.8671 0.1841 126.6025 6.4172 1.5624 0.0760 0.0010 8.5426 0.0093 5.5337 0.0028 76.1972 4.6297 3.7795 0.0186 23.5455 6.8031 35.8899 4.5851 1.0282 2.1291 18.6680 3.3436 0.5192 85.2733 7.7227 67.0667 3.5434 22.0266 43.7508 42.0229 3.1072 2.1789 3.1302 37.3621 12.7283 37.5725 2.6028 2.7700 10.6102 94.7426 153.5245 0.3051 493.1947 8.2570 0.7676 1.6464 5.3639 29.1978 1.6477 17.2257 32.4548 11.3066 12.6839 84.0433 10.8973 0.2398 12.6901 46.2543 4.2772 6.8874 11.4170 0.1051 66.0082 0.3311 44.8560 8.9008 20.0041 1.4826 8.1837 647.0205 64.5966 102.5433 104.4758 0.0033 152.4456 104.1620 5.1081 109.0148 177.3153 44.8739 143.8774 32.1260 39.3668 20.5525 24.7596 8.9466 41.5775 1.1246 91.2507 16.6004 94.2552 18.3279 9.4586 59.5820 15.0816 4.8432 6.5768 18.5638 2.6246 23.1883 29.4091 3.6627 0.7185
temp: 298.150 k
press: 1.00000 atm
elementType: 8 8 7 7 7 7 6 6 6 6 6 6 6 6 6 6 6 6 6 6 6 6 6 6 6 6 6 6 1 1 1 1 1 1 1 1 1 1 1 1 1 1 1 1 1 1 1 1 1 1 1 1 1 1 1 1
symmnumber: 1
zpe: 1220712.4 jmol-1
zpe.correction: 0.464945 hartree
zpe.thermalcorrener: 0.492710 hartree
zpe.thermalcorrenthalpy: 0.493655 hartree
zpe.thermalcorrgfe: 0.403395 hartree
zpe.sumelectzpe: -1222.551632 hartree
zpe.sumelectthermal: -1222.523866 hartree
zpe.sumelectthermalent: -1222.522922 hartree
zpe.sumelectthermalfe: -1222.613182 hartree
dipole: -0.0005 -3.5697 0.0008
dipole: 3.5697
quadrupole: -138.7278 -154.6784 -169.7128
quadrupole: 0.0045 -8.3475 0.0016
quadrupole: 15.6452 -0.3054 -15.3398 0.0045 -8.3475 0.0016
hfenergy: -1223.0165768 hartree
pointgroup: C01 [X(C22H28N4O2)]
dipole: 0.0001322 -1.4044386 -0.000367 debye
polarizability: 408.4620088|-0.0049311|444.7885632|-4.4967768|-0.0005034|145.8177529 unknown
InChI: InChI=1S/C22H28N4O2/c1-3-23-11-13-25-17-9-10-18(26-14-12-24-4-2)20-19(17)21(27)15-7-5-6-8-16(15)22(20)28/h5-10,23-26H,3-4,11-14H2,1-2H3
charge 0 multiplicity 1
56 atoms
O  2.772635 1.740362 -0.100533
O  -2.772674 1.739837 0.101131
N  2.818301 -0.828697 -0.087389
N  -2.818121 -0.828674 0.087706
N  5.960337 -2.883289 -0.141083
N  -5.960308 -2.883047 0.141121
C  0.723757 0.443425 -0.024126
C  -0.723606 0.443359 0.024657
C  1.445946 -0.808156 -0.045515
C  -1.445752 -0.808216 0.045968
C  1.469134 1.703595 -0.052276
C  -1.469168 1.703383 0.052921
C  0.71207 2.977253 -0.025573
C  -0.712308 2.977156 0.026001
C  0.692573 -2.036784 -0.021745
C  -0.692345 -2.036819 0.022203
C  3.639508 -2.041721 -0.101964
C  -3.639415 -2.041639 0.102295
C  5.133272 -1.666092 -0.046855
C  -5.133145 -1.665917 0.046891
C  1.413896 4.211198 -0.05108
C  -1.414308 4.211003 0.051364
C  0.709979 5.428403 -0.02574
C  -0.710564 5.428305 0.025868
C  7.403935 -2.679357 0.120499
C  -7.403842 -2.679056 -0.12077
C  8.177395 -4.000563 -0.025414
C  -8.177419 -4.000188 0.025183
H  1.226808 -2.991189 -0.039265
H  -1.226543 -2.991245 0.039658
H  3.242345 0.12971 -0.111927
H  -3.242119 0.129757 0.111999
H  3.411102 -2.696349 0.762486
H  3.443442 -2.63621 -1.022477
H  -3.410906 -2.696375 -0.762046
H  -3.443537 -2.63603 1.022909
H  5.352747 -0.910273 -0.842778
H  5.347237 -1.177705 0.923317
H  -5.352708 -0.909988 0.842685
H  -5.346908 -1.177631 -0.923376
H  2.506831 4.177801 -0.090481
H  -2.507238 4.177453 0.090786
H  1.255839 6.378094 -0.045602
H  -1.256557 6.377922 0.045617
H  5.812182 -3.374857 -1.034777
H  -5.812352 -3.374513 1.034904
H  7.856356 -1.906263 -0.550422
H  7.509673 -2.299838 1.155714
H  -7.85634 -1.905833 0.54995
H  -7.509351 -2.299682 -1.156061
H  7.767522 -4.762812 0.659974
H  8.10777 -4.393368 -1.058332
H  9.24785 -3.85567 0.20572
H  -8.108026 -4.392848 1.058171
H  -9.247819 -3.855258 -0.206182
H  -7.767462 -4.762565 -0.660012
