program: Gaussian 09
title: 000100210
version: EM64L-G09RevD.01
frameworkgroup: C1[X(C7H17NO6S)]
method: RPBEPBE
basis: SDD
operation: Freq
keyword: #p
keyword: freq=noraman
keyword: PBEPBE/SDD
title: #p freq=noraman PBEPBE/SDD
converged: YES YES NO NO
title: Mulliken charges:
elementType: S O O O O O O N C C C C C C C H H H H H H H H H H H H H H H H H
charge: 1.046176 -0.442753 -0.585141 -0.456465 -0.452506 -0.500910 -0.524534 -0.127592 -0.434915 -0.039529 -0.611826 -0.367429 -0.362831 -0.313571 -0.306707 0.219881 0.232364 0.265892 0.323317 0.303913 0.218980 0.231673 0.234381 0.222670 0.192693 0.216235 0.185319 0.201321 0.352611 0.378469 0.351319 0.349495
chargesum: 0.00000
title: Mulliken charges with hydrogens summed into heavy atoms:
elementType: S O O O O O O N C C C C C C C
charge: 1.046176 -0.090143 -0.206671 -0.105147 -0.103010 -0.500910 -0.524534 -0.127592 0.017330 0.226363 0.015404 0.083224 0.094220 0.095357 0.079932
polarizability: 1.49765429e+02 -9.40473456e-01 1.26689361e+02 -4.94074973e+00 2.22676193e+00 1.26481550e+02
1716.lowfreq: -9.2535 -6.6877 -0.0014 0.0010 0.0018 4.5736 12.3238 27.1507 30.0172
frequency: 11.5587 27.1090 29.9650 38.1841 47.6751 65.7868 87.7784 99.1160 123.5970 144.9290 157.0096 189.3838 193.8639 235.2918 240.8404 251.9813 257.5224 270.2305 283.2217 301.2531 310.1323 321.7513 337.3428 359.2524 376.0506 420.6276 450.1566 516.0469 532.3138 545.3942 605.4108 805.2111 811.5349 827.0883 838.4604 848.2421 886.2722 944.0868 971.4372 980.1987 989.9540 1014.4944 1019.1924 1033.9952 1047.9886 1059.9515 1067.8183 1081.1810 1138.1962 1148.7246 1161.9337 1186.6923 1208.2960 1215.8562 1232.3838 1247.0763 1260.3440 1277.3198 1289.4829 1313.9017 1316.2261 1344.0688 1350.9276 1358.2391 1377.3993 1403.4441 1410.2089 1417.1973 1461.0684 1468.1125 1474.6009 1483.5721 1486.2335 2876.3209 2930.5479 2937.8412 2946.7280 2968.9639 2974.6535 2990.3307 3002.2871 3035.8718 3045.0890 3056.6778 3063.6697 3161.8449 3499.8048 3581.4540 3584.6184 3585.3024
redmass: 9.0791 6.3842 6.3157 3.9665 3.1437 4.2778 2.8814 2.5737 5.1091 6.0307 3.0662 1.9381 6.9266 2.5649 1.1832 1.2067 1.0805 2.5249 2.7484 6.2134 3.8230 4.8164 4.5459 2.9186 5.0039 2.7824 3.8146 3.6153 4.5286 6.6263 4.3028 1.1352 1.1484 2.4354 9.6417 4.4459 1.9708 4.6909 5.1902 5.9170 3.1304 2.2751 2.1989 1.8487 2.1282 1.9671 1.9703 1.7892 1.4046 1.2774 1.4289 1.1130 1.2516 1.2405 1.2095 1.4970 1.5323 1.2446 1.1653 1.3066 1.3213 1.3308 1.4222 1.3105 1.1050 1.4751 1.4300 1.4301 1.0892 1.0730 1.0768 1.0830 1.0852 1.0705 1.0569 1.0691 1.0565 1.0599 1.0843 1.1027 1.1039 1.1040 1.0921 1.0554 1.0955 1.1114 1.0664 1.0667 1.0665 1.0667
irintensity: 1.2816 0.6657 2.3407 0.5209 1.2557 1.5011 14.6620 7.1232 5.9327 5.2681 5.0721 23.9127 1.2722 2.7012 31.7262 200.6857 195.2085 34.7353 16.7120 24.3106 53.9267 10.2954 41.6583 11.5540 43.4590 10.3773 23.8935 8.3984 59.5090 75.7060 4.5279 5.3528 5.3584 7.8076 55.5502 11.1464 24.3346 50.0875 178.5842 87.8995 9.5964 46.1394 9.5303 9.5794 42.0696 163.0332 4.9908 23.5763 7.6078 17.3240 7.3623 4.4419 45.7239 41.7814 11.0795 26.0940 18.5054 7.3010 7.9028 6.0301 12.5862 5.2268 7.2716 3.0530 14.9843 8.2534 0.2787 0.4574 7.8597 7.9905 7.0578 10.0029 6.5572 93.8211 63.8261 91.3622 38.6360 63.8434 11.5925 53.9252 11.7204 40.8670 32.1227 8.1798 43.0412 9.1223 41.5380 6.8955 16.6643 7.1660
temp: 298.150 k
press: 1.00000 atm
elementType: 16 8 8 8 8 8 8 7 6 6 6 6 6 6 6 1 1 1 1 1 1 1 1 1 1 1 1 1 1 1 1 1
symmnumber: 1
zpe: 659928.3 jmol-1
zpe.correction: 0.251353 hartree
zpe.thermalcorrener: 0.271524 hartree
zpe.thermalcorrenthalpy: 0.272468 hartree
zpe.thermalcorrgfe: 0.199308 hartree
zpe.sumelectzpe: -1179.613145 hartree
zpe.sumelectthermal: -1179.592974 hartree
zpe.sumelectthermalent: -1179.592030 hartree
zpe.sumelectthermalfe: -1179.665191 hartree
dipole: -2.4017 -1.0139 -0.9315
dipole: 2.7684
quadrupole: -125.6152 -101.8439 -82.7133
quadrupole: 6.5849 -4.2523 1.6537
quadrupole: -22.2244 1.5469 20.6775 6.5849 -4.2523 1.6537
hfenergy: -1179.8644986 hartree
pointgroup: C01 [X(C7H17N1O6S1)]
dipole: 0.9425524 0.4257073 -0.3415285 debye
polarizability: 148.8673838|1.4296935|126.2826931|6.6984522|-1.7314997|127.7862622 unknown
InChI: InChI=1S/C7H17NO6S/c9-3-1-8(2-4-10)5-7(11)6-15(12,13)14/h7,9-12H,1-6H2
charge 0 multiplicity 1
32 atoms
S  -2.5786 0.012468 -0.847066
O  -1.582308 1.103844 2.232644
O  -1.859396 0.086278 -2.57647
O  1.606788 -3.61502 -0.091878
O  3.797528 2.465408 -1.339748
O  -3.991392 0.793885 -0.845854
O  -2.515955 -1.522542 -0.32658
N  1.677391 0.063963 0.58662
C  0.794932 0.757486 1.530119
C  -0.709117 0.456187 1.246011
C  -1.100894 1.021509 -0.103256
C  1.83152 -1.394177 0.792613
C  2.872001 0.809234 0.134611
C  1.308705 -2.207332 -0.404294
C  2.546194 1.760988 -1.028635
H  0.989314 0.470846 2.592774
H  0.957279 1.848996 1.459901
H  -0.855919 -0.644406 1.251464
H  -0.311963 0.878874 -0.856306
H  -1.492633 2.048367 -0.047564
H  1.280336 -1.712871 1.69917
H  2.893518 -1.664882 0.960754
H  3.632412 0.08938 -0.215594
H  3.338344 1.400203 0.953947
H  1.829802 -1.886814 -1.331606
H  0.218702 -2.043607 -0.534065
H  1.752364 2.479709 -0.726343
H  2.177649 1.172366 -1.895374
H  -1.545603 0.609653 3.089174
H  -2.55656 -0.248551 -3.21021
H  1.141867 -4.203394 -0.73673
H  3.661293 3.065652 -2.11433
