program: Gaussian 09
title: 000100207
version: EM64L-G09RevD.01
frameworkgroup: C1[X(C15H18O4)]
method: RPBEPBE
basis: SDD
operation: Freq
keyword: #pfreq=noraman
keyword: PBEPBE/SDD
title: #p freq=noraman PBEPBE/SDD
converged: YES YES NO NO
title: Mulliken charges:
elementType: O O O O C C C C C C C C C C C C C C C H H H H H H H H H H H H H H H H H H
charge: -0.225416 -0.421578 -0.198801 -0.204435 -0.298485 -0.076317 -0.201597 -0.596580 0.399864 -0.329724 0.072596 0.401634 0.423353 -0.566660 -0.505488 -0.232584 -0.665120 -0.837997 -0.259477 0.275606 0.205995 0.248418 0.248490 0.266996 0.237212 0.228825 0.224667 0.220158 0.231987 0.222709 0.229715 0.256756 0.338903 0.235874 0.242297 0.232668 0.175537
chargesum: 0.00000
title: Mulliken charges with hydrogens summed into heavy atoms:
elementType: O O O O C C C C C C C C C C C C C C C
charge: -0.225416 -0.082675 -0.198801 -0.204435 -0.022879 0.129678 0.046821 -0.081094 0.399864 -0.092513 0.072596 0.401634 0.423353 -0.113168 -0.053343 -0.009875 -0.178649 -0.127158 -0.083940
polarizability: 2.13415302e+02 8.11719534e+00 1.38612815e+02 1.22767514e+01 2.42290145e+00 1.57716538e+02
1716.lowfreq: -16.7616 -8.9762 -0.0005 0.0005 0.0008 10.8450 37.1655 52.5740 55.3565
frequency: 36.8258 52.4557 55.3054 75.3760 85.1871 108.4402 129.5461 150.8428 162.9250 175.2804 195.0315 218.3327 227.0044 256.4908 288.1082 293.2565 298.8171 317.0078 354.4937 356.8026 385.7250 420.2822 456.0400 470.0560 501.3006 527.3254 544.0787 554.2019 591.5263 603.7218 628.8849 659.3177 704.2793 772.9416 781.4523 789.4915 807.5353 819.0016 835.0070 879.6239 890.8859 904.9879 943.0217 947.5037 955.8199 967.0630 981.2562 983.4996 992.6661 1012.3831 1020.6264 1034.3831 1034.8566 1066.7014 1080.4545 1103.2739 1137.8869 1153.9160 1169.4984 1174.6101 1216.2252 1222.2865 1238.9593 1254.4813 1266.4186 1277.2928 1284.8667 1290.3139 1313.6471 1320.8585 1349.4961 1358.2084 1368.1589 1371.9045 1394.2419 1398.4221 1422.3618 1456.4290 1461.9477 1464.7599 1469.1376 1472.9461 1577.2678 1629.3781 1672.4796 1676.2368 1691.8432 2914.6210 2958.4437 2987.0904 3004.3599 3010.9194 3016.3413 3033.7013 3034.6073 3045.6259 3049.3144 3062.2360 3072.1713 3076.5390 3084.0910 3086.2320 3099.4398 3207.8642 3539.5513
redmass: 6.9645 5.3315 5.5590 3.7342 4.2331 1.4665 2.3554 4.2091 4.1142 4.1228 2.6889 2.9454 3.4561 1.3747 3.1291 4.5091 3.0139 3.1148 4.2215 3.2091 4.9179 2.7229 2.9982 2.7918 3.4530 3.4685 3.5125 2.6414 2.4443 3.8542 4.0970 4.0738 4.4229 2.0705 4.0798 2.6715 2.5188 2.8842 1.6593 1.6896 2.3279 2.6702 2.2103 2.3947 2.1733 2.6726 1.5746 1.5682 1.9075 4.4492 2.5261 1.7627 2.3863 2.4511 2.8004 2.2321 1.6966 1.2856 1.2240 1.2352 1.7764 1.4637 1.5911 2.6676 1.5837 1.2157 1.3110 1.4008 1.4114 1.4962 1.4309 1.1909 1.2957 1.4234 1.4343 1.3301 1.1746 1.0737 1.0762 1.0875 1.0865 1.0926 7.4611 6.0880 6.6770 7.1621 11.6742 1.0841 1.0418 1.0591 1.0621 1.0620 1.0834 1.0853 1.0906 1.0863 1.1025 1.0919 1.0899 1.1025 1.0971 1.0978 1.0621 1.1156 1.0661
irintensity: 2.1882 2.5322 4.5376 1.4085 1.5938 0.6409 2.3771 5.0557 2.4196 0.6478 4.9476 20.2449 6.2335 103.4315 9.7043 5.4234 3.4931 5.5959 2.5292 1.6200 2.8216 2.8309 8.0848 9.4141 0.8500 13.4951 10.2828 1.8373 8.3566 13.5965 1.7232 7.0542 1.9395 4.3034 5.9386 1.9337 20.4513 11.4589 24.7994 13.5176 17.7995 8.9285 12.6178 42.6617 14.4072 71.2094 13.3921 39.0523 95.6261 44.2800 42.6797 23.3485 92.3814 9.1249 15.0185 3.6008 11.3363 24.0729 11.5332 5.7202 11.5561 47.1924 6.3640 69.9231 6.1166 4.5835 2.5595 1.8058 4.0678 7.0410 9.8107 26.9180 25.0571 3.6987 8.5667 21.2706 24.0701 11.3290 13.5893 13.8996 29.4707 3.8924 138.9910 40.6434 36.0695 2.9262 296.3429 75.8569 20.9698 31.0670 53.0103 11.0385 23.4325 10.4336 21.5156 9.8557 14.5388 0.4385 7.0175 6.7878 41.4697 29.7059 4.2855 2.8046 9.1374
temp: 298.150 k
press: 1.00000 atm
elementType: 8 8 8 8 6 6 6 6 6 6 6 6 6 6 6 6 6 6 6 1 1 1 1 1 1 1 1 1 1 1 1 1 1 1 1 1 1
symmnumber: 1
zpe: 779536.6 jmol-1
zpe.correction: 0.296910 hartree
zpe.thermalcorrener: 0.315646 hartree
zpe.thermalcorrenthalpy: 0.316590 hartree
zpe.thermalcorrgfe: 0.250374 hartree
zpe.sumelectzpe: -881.792199 hartree
zpe.sumelectthermal: -881.773463 hartree
zpe.sumelectthermalent: -881.772519 hartree
zpe.sumelectthermalfe: -881.838735 hartree
dipole: -8.0749 -1.9177 -0.4527
dipole: 8.3118
quadrupole: -123.0767 -128.7834 -107.2582
quadrupole: -1.4024 9.9437 -6.0414
quadrupole: -3.3706 -9.0773 12.4479 -1.4024 9.9437 -6.0414
hfenergy: -882.0891089 hartree
pointgroup: C01 [X(C15H18O4)]
dipole: -3.1909196 0.6932845 0.1764775 debye
polarizability: 214.0024694|-6.1908541|138.1773651|-11.9181115|0.8988728|157.5648204 unknown
InChI: InChI=1S/C15H18O4/c1-9-4-3-5-11(8-16)7-13-14(12(17)6-9)10(2)15(18)19-13/h5-6,8,12-14,17H,2-4,7H2,1H3
charge 0 multiplicity 1
37 atoms
O  2.233033 -0.761028 1.375539
O  1.297945 2.627662 0.810014
O  4.372253 -0.48201 0.493899
O  -0.823892 -2.624049 -1.890074
C  0.899869 0.402697 -0.325186
C  0.822265 -0.507824 0.94894
C  0.385184 1.870177 -0.057733
C  0.108015 -1.868868 0.744586
C  2.363882 0.337349 -0.71988
C  -1.022908 1.8244 0.51173
C  3.146956 -0.314774 0.378185
C  -1.332032 -1.664799 0.279801
C  -2.179979 1.577586 -0.166047
C  -3.427646 1.175013 0.615758
C  -3.580576 -0.401312 0.642908
C  -2.257486 -1.007539 1.058183
C  2.960863 0.767378 -1.857585
C  -2.269437 1.487525 -1.67679
C  -1.667366 -2.127833 -1.087529
H  0.261504 -0.015645 -1.122831
H  0.35762 0.021143 1.80118
H  0.429035 2.420558 -1.013582
H  0.151441 -2.428802 1.69648
H  0.653347 -2.453905 -0.017442
H  -1.072389 1.882098 1.610638
H  -3.355422 1.539162 1.658039
H  -4.348796 1.60175 0.174808
H  -3.914637 -0.754019 -0.347255
H  -4.374428 -0.657011 1.370404
H  -1.953174 -0.746059 2.085286
H  2.400616 1.235087 -2.674531
H  4.043734 0.652449 -1.981476
H  1.340604 2.201488 1.705081
H  -3.193154 1.975871 -2.040097
H  -2.311857 0.434001 -2.022259
H  -1.412897 1.964345 -2.182401
H  -2.740091 -2.054563 -1.384762
