program: Gaussian 09
title: 000100216
version: EM64L-G09RevD.01
frameworkgroup: C1[X(C21H19NO6)]
method: RPBEPBE
basis: SDD
operation: Freq
keyword: #p
keyword: freq=noraman
keyword: PBEPBE/SDD
title: #p freq=noraman PBEPBE/SDD
converged: YES YES NO NO
title: Mulliken charges:
elementType: O O O O O O N C C C C C C C C C C C C C C C C C C C C C H H H H H H H H H H H H H H H H H H H
charge: -0.196968 -0.269795 -0.302521 -0.256270 -0.258535 -0.300355 -0.168613 -0.371130 -0.375673 0.479241 -0.640064 0.232066 0.055630 -0.695244 0.202044 0.509301 0.170042 -0.471556 0.010183 -0.565032 -0.478137 0.195957 0.184575 0.197653 -0.378888 -0.202141 -0.526660 -0.529896 0.257179 0.235457 0.270890 0.221320 0.251400 0.256639 0.294415 0.239790 0.261360 0.303184 0.251751 0.243848 0.244257 0.225139 0.230657 0.255097 0.256912 0.222457 0.229034
chargesum: 0.00000
title: Mulliken charges with hydrogens summed into heavy atoms:
elementType: O O O O O O N C C C C C C C C C C C C C C C C C C C C C
charge: -0.196968 -0.269795 -0.302521 -0.256270 -0.258535 -0.300355 -0.168613 -0.113951 0.130675 0.479241 -0.167344 0.232066 0.055630 -0.144190 0.202044 0.509301 0.170042 -0.231766 0.010183 -0.303672 -0.174953 0.195957 0.184575 0.197653 -0.127137 0.285964 0.184233 0.178507
polarizability: 3.70749164e+02 -5.53106866e+00 2.11974706e+02 -1.90285373e+01 -8.63532784e+00 1.99710496e+02
1716.lowfreq: -10.2025 -6.7083 -4.1495 -0.0008 -0.0007 0.0007 6.3981 11.9156 30.9093
frequency: 4.7416 11.0266 30.8749 42.3061 67.2732 74.7932 84.7227 101.3802 104.7256 110.5292 128.0702 150.5896 154.1333 167.5744 185.6957 207.0917 224.1561 241.3131 246.3132 262.9991 286.1946 298.5347 323.7564 342.2389 358.9765 368.5130 381.1395 395.5107 417.0667 426.2689 450.5951 464.5142 488.2978 516.5376 539.3121 559.1604 569.3929 587.5682 602.8922 610.1146 646.6009 648.2033 671.2950 681.1124 705.0530 721.2432 731.8041 751.9388 775.7667 791.2004 806.2409 817.6089 832.9735 840.7282 871.1201 872.8343 896.5349 912.0253 915.2829 931.2065 941.4685 949.3053 968.3215 981.2251 988.0966 1017.9846 1032.6488 1060.6892 1064.0117 1082.8863 1112.7833 1116.0725 1119.3445 1140.7335 1148.5753 1153.6752 1158.9005 1161.8958 1168.6420 1173.0798 1200.6456 1205.3101 1213.9731 1218.2200 1230.7657 1243.2239 1248.6871 1270.8377 1273.9173 1290.9561 1323.2554 1352.4454 1361.6390 1370.1603 1405.1369 1410.7522 1415.2632 1416.5044 1427.1388 1445.3525 1445.7111 1456.6986 1459.4157 1470.8065 1475.4325 1479.4382 1482.8537 1484.7274 1487.1709 1487.6050 1561.8519 1594.5837 1600.0717 1606.9532 1608.9537 1622.7972 2962.0827 2969.0411 2972.4708 2974.8745 2986.4846 2994.3663 3020.6673 3048.2718 3069.9074 3070.7040 3072.3156 3101.9105 3103.9619 3121.8742 3122.5051 3134.4083 3168.4545 3168.5435 3180.8532
redmass: 3.5648 3.4575 5.2800 5.1521 7.5970 4.0010 6.4430 3.6917 3.8666 3.8429 4.2506 1.1266 1.1132 5.7115 3.2019 3.4538 4.4188 5.9042 4.3589 5.5696 4.4338 4.1386 4.4874 5.6808 7.4877 5.6056 5.7781 5.8585 4.4392 3.8142 4.7227 5.4666 5.5257 5.2673 3.8311 4.6824 4.6390 4.4758 6.0832 4.8355 5.6642 4.6839 6.1262 8.4285 5.5433 5.2135 3.8044 4.2718 4.5943 5.9822 3.8557 2.8885 7.1047 2.4612 1.5280 2.9274 2.7117 4.6345 1.5516 3.4604 2.8708 1.4981 5.0953 4.1758 3.7259 2.1926 4.2482 3.9194 1.4574 2.4972 1.2398 1.2350 1.0374 1.3719 1.9833 1.4137 1.8681 1.8404 1.2948 2.3257 2.0007 1.9828 1.7032 1.3628 1.7905 2.0618 2.0080 2.4154 2.3765 2.4750 1.5231 1.4616 1.3091 7.1193 4.2085 3.1901 1.7051 4.2163 1.3410 1.1950 1.7030 1.0564 1.1062 2.2564 1.5124 1.4481 1.0871 1.1328 1.3841 1.0604 11.6125 8.1400 8.9044 9.1538 8.6383 8.2555 1.0699 1.0664 1.0309 1.0308 1.0662 1.0825 1.0536 1.0957 1.1038 1.0960 1.1044 1.1191 1.0894 1.1029 1.1031 1.0893 1.0956 1.0929 1.0927
irintensity: 7.7037 6.2557 1.2571 1.8412 2.1952 3.0225 2.9055 3.1721 6.7144 0.7417 2.5425 0.0315 0.0488 3.3020 4.4171 4.9082 0.9883 6.4251 10.6026 4.7377 5.0776 2.4520 3.3764 1.1993 7.5929 3.4283 1.6303 12.3616 7.9100 4.6649 5.3545 5.8396 8.7504 1.8083 7.6577 10.3773 20.0001 10.0527 18.7999 2.2044 7.5794 10.8821 12.2326 0.1020 0.6264 3.7176 25.0209 16.1549 5.9812 9.2486 19.9201 16.5480 17.4898 22.1432 15.1694 10.1020 6.2245 2.3714 30.9279 15.7873 30.3425 3.9297 127.1564 11.3220 116.4394 3.5813 62.1677 39.5636 4.9557 4.3655 12.3962 4.5732 0.0518 5.6675 10.6923 1.6409 27.6712 5.5736 61.1492 11.4144 17.5386 32.9971 86.9429 33.5333 72.3743 109.7825 238.3445 192.7662 56.1796 29.8609 32.8426 16.6828 1.0094 42.1940 47.0161 85.1608 6.8182 15.7849 13.3577 13.8377 48.5036 17.6616 0.2213 209.8026 25.1587 8.2507 18.4319 18.0223 72.8758 17.5991 187.3845 15.5807 244.7937 8.7704 42.8646 22.6198 9.2540 35.5051 93.2493 55.4820 43.6240 13.5014 126.6402 18.0773 27.6894 14.5142 24.3539 26.1922 0.4150 25.1059 21.9151 9.5593 8.2910 2.6421 9.1368
temp: 298.150 k
press: 1.00000 atm
elementType: 8 8 8 8 8 8 7 6 6 6 6 6 6 6 6 6 6 6 6 6 6 6 6 6 6 6 6 6 1 1 1 1 1 1 1 1 1 1 1 1 1 1 1 1 1 1 1
symmnumber: 1
zpe: 944098.6 jmol-1
zpe.correction: 0.359588 hartree
zpe.thermalcorrener: 0.384313 hartree
zpe.thermalcorrenthalpy: 0.385257 hartree
zpe.thermalcorrgfe: 0.301614 hartree
zpe.sumelectzpe: -1315.675487 hartree
zpe.sumelectthermal: -1315.650762 hartree
zpe.sumelectthermalent: -1315.649818 hartree
zpe.sumelectthermalfe: -1315.733461 hartree
dipole: -1.9386 0.9194 -1.7710
dipole: 2.7821
quadrupole: -125.5880 -154.9253 -172.6329
quadrupole: 1.2718 3.0003 -19.3678
quadrupole: 25.4607 -3.8765 -21.5842 1.2718 3.0003 -19.3678
hfenergy: -1316.0350749 hartree
pointgroup: C01 [X(C21H19N1O6)]
dipole: -0.7560268 0.4862686 -0.6245188 debye
polarizability: 371.3173079|-0.7909938|214.7929022|-17.0834728|-5.759554|196.3241558 unknown
InChI: InChI=1S/C21H19NO6/c1-25-15-4-3-12-14(21(15)26-2)9-18(23)22-6-5-11-7-16-17(28-10-27-16)8-13(11)20(24)19(12)22/h3-4,7-8,19H,5-6,9-10H2,1-2H3
charge 0 multiplicity 1
47 atoms
O  -0.202528 -1.051282 -1.748216
O  0.055296 1.099173 3.047393
O  4.182065 -1.185582 1.480846
O  -6.167046 -0.468951 0.269441
O  -5.017283 -2.433619 -0.503631
O  5.824264 -0.598569 -0.848171
N  -0.030426 1.493285 0.751744
C  0.319924 1.0640 -0.620494
C  -1.004406 2.585305 0.913884
C  1.774458 0.634572 -0.707726
C  -2.134727 2.511984 -0.145781
C  2.312145 -0.065513 0.398376
C  -0.658553 -0.074318 -1.087848
C  1.415579 -0.337334 1.590169
C  0.43004 0.802607 1.872668
C  -2.801476 1.147574 -0.238179
C  -2.106112 -0.025814 -0.68659
C  2.564108 0.891163 -1.84676
C  3.658742 -0.496213 0.360402
C  -4.182302 1.063506 0.098918
C  -2.797437 -1.276976 -0.813353
C  -4.821447 -0.171591 -0.014001
C  -4.138875 -1.321871 -0.468453
C  4.472129 -0.191046 -0.769566
C  3.913813 0.481764 -1.876651
C  -6.324063 -1.928775 -0.011596
C  4.572763 -2.590684 1.209183
C  6.715522 -0.00142 0.175314
H  0.167175 1.926072 -1.298208
H  -0.496333 3.567922 0.831852
H  -1.408587 2.49724 1.937001
H  -1.735557 2.808485 -1.135745
H  -2.885409 3.278147 0.117941
H  0.819188 -1.258072 1.412786
H  2.000742 -0.512609 2.50497
H  2.132557 1.410841 -2.709267
H  -4.729655 1.94679 0.438338
H  -2.25132 -2.149566 -1.179672
H  4.556182 0.681278 -2.739585
H  -7.083762 -2.056904 -0.800517
H  -6.583843 -2.443256 0.92922
H  3.687122 -3.18117 0.908176
H  4.973337 -2.971071 2.161081
H  5.340717 -2.636661 0.416501
H  6.353492 -0.224621 1.194706
H  6.777549 1.093724 0.029741
H  7.702138 -0.458547 0.005065
