program: Gaussian 09
title: 000102831
version: EM64L-G09RevD.01
frameworkgroup: C1[X(C10H9N3O6S)]
method: RPBEPBE
basis: SDD
operation: Freq
keyword: #p
keyword: freq=noraman
keyword: PBEPBE/SDD
title: #p freq=noraman PBEPBE/SDD
converged: YES YES NO NO
title: Mulliken charges:
elementType: S O O O O O O N N N C C C C C C C C C C H H H H H H H H H
charge: 0.993577 -0.170759 -0.567747 -0.434941 -0.501296 -0.500531 -0.201706 -0.282688 0.015026 -0.543532 -0.330989 0.178574 0.445868 0.088555 -0.323267 -0.352292 -0.079235 -0.223426 -0.204863 0.129950 0.301038 0.312398 0.302609 0.284745 0.286179 0.285605 0.312735 0.383369 0.397045
chargesum: 0.00000
title: Mulliken charges with hydrogens summed into heavy atoms:
elementType: S O O O O O O N N N C C C C C C C C C C
charge: 0.993577 -0.170759 -0.184378 -0.037897 -0.501296 -0.500531 -0.201706 -0.282688 0.015026 0.054809 -0.029951 0.178574 0.445868 0.088555 -0.010870 -0.049683 -0.079235 0.061319 0.081315 0.129950
polarizability: 3.18141572e+02 5.52268941e+00 1.78817440e+02 -9.89071334e-01 -1.83598110e+00 9.55564225e+01
1716.lowfreq: -7.5327 -0.0014 -0.0012 -0.0007 3.3253 6.2009 18.8904 34.5209 51.8496
frequency: 18.6422 34.5135 51.8380 57.0462 68.0170 76.7842 104.4810 125.7046 160.0645 166.0108 175.4191 191.1944 221.5174 227.7409 270.1906 286.3974 295.7353 310.8393 321.7744 338.8123 367.8853 393.3029 414.2243 418.0335 424.8064 474.2199 497.4574 518.0363 559.1121 568.4959 588.5572 606.1156 617.7346 645.9025 681.1925 706.6627 726.7414 735.9385 769.1303 834.1390 853.6002 855.0665 865.4978 903.3276 967.5028 987.4961 991.4642 995.6759 1002.9304 1045.1449 1059.7473 1062.9662 1073.3481 1121.9114 1128.3265 1151.8712 1179.6585 1187.2329 1216.3802 1290.9157 1301.1839 1333.4343 1358.6435 1389.3246 1414.1816 1476.6540 1517.2910 1591.4564 1595.0872 1640.6249 1657.1167 1673.7636 3014.4687 3164.2735 3165.1962 3195.3420 3197.0405 3479.5716 3500.5760 3525.3684 3636.0680
redmass: 9.4935 6.9500 5.2689 6.4878 8.2758 6.5177 9.1004 8.9309 6.3382 3.4245 2.1675 4.3411 2.8020 1.9881 2.9725 3.6807 4.6380 6.8911 8.2053 9.4407 9.5752 7.4180 3.5984 5.1507 7.3910 5.5519 1.5650 4.0064 6.6839 2.6003 3.7047 2.4127 6.8465 3.3950 6.9634 8.6520 8.7780 4.0569 6.0002 12.9964 1.8309 2.2537 1.5085 6.6394 17.3499 4.1800 1.4447 5.8008 1.3521 1.2614 3.1493 2.9877 3.2689 1.3496 1.3360 1.7969 3.4728 1.1831 1.8095 3.0233 1.2871 1.4370 4.9325 10.3844 3.2340 2.5431 10.2685 8.1072 5.9278 1.3202 7.4144 4.6636 1.0819 1.0912 1.0916 1.0945 1.0960 1.0661 1.0449 1.0643 1.1007
irintensity: 1.0962 0.5980 2.3197 1.7791 0.4115 1.1892 0.3084 1.1457 3.9672 27.7144 25.4003 5.5615 20.4648 8.4275 66.1101 25.2082 1.3378 21.6138 58.1909 31.6976 3.9056 1.3765 1.8551 5.6311 20.3356 14.9468 264.4619 34.6284 238.5722 7.0029 41.4357 99.2686 3.0534 50.9454 38.6644 9.9926 24.3990 3.0889 7.3898 96.4578 3.2089 7.8238 74.9527 18.9454 72.6289 2.3491 7.7058 495.6071 1.4143 58.8559 38.3557 229.9427 31.5498 36.3134 13.0264 107.6828 26.8923 4.0943 20.3807 214.5514 2.3867 7.8295 9.0895 14.1104 14.3360 171.7151 156.9479 0.2935 106.0528 89.9648 278.6811 132.4582 4.3506 1.9178 4.6988 3.7858 3.1825 45.4649 22.4935 76.6235 16.6307
temp: 298.150 k
press: 1.00000 atm
elementType: 16 8 8 8 8 8 8 7 7 7 6 6 6 6 6 6 6 6 6 6 1 1 1 1 1 1 1 1 1
symmnumber: 1
zpe: 501337.8 jmol-1
zpe.correction: 0.190950 hartree
zpe.thermalcorrener: 0.210676 hartree
zpe.thermalcorrenthalpy: 0.211620 hartree
zpe.thermalcorrgfe: 0.140948 hartree
zpe.sumelectzpe: -1398.462299 hartree
zpe.sumelectthermal: -1398.442572 hartree
zpe.sumelectthermalent: -1398.441628 hartree
zpe.sumelectthermalfe: -1398.512300 hartree
dipole: -7.0963 0.1173 1.7041
dipole: 7.2990
quadrupole: -107.4848 -140.9955 -120.7409
quadrupole: 2.6272 10.2496 0.6530
quadrupole: 15.5890 -17.9218 2.3328 2.6272 10.2496 0.6530
hfenergy: -1398.6532482 hartree
pointgroup: C01 [X(C10H9N3O6S1)]
dipole: -2.7893235 0.164195 0.6626987 debye
polarizability: 318.3123157|2.3677526|177.7210056|-1.5477571|-8.8931756|96.4821134 unknown
InChI: InChI=1S/C10H9N3O6S/c11-7-8(10(15)16)12-13(9(7)14)5-1-3-6(4-2-5)20(17,18)19/h1-4,7,15,17H,11H2
charge 0 multiplicity 1
29 atoms
S  4.88871 -0.422648 -0.013937
O  -1.452953 2.682406 -0.461258
O  5.084576 -0.181676 1.820714
O  -5.530154 -0.802452 -0.073117
O  5.258078 -1.956683 -0.371398
O  5.623459 0.801948 -0.774237
O  -4.177248 -2.65445 0.372188
N  -1.127832 0.331785 -0.132141
N  -1.932408 -0.818287 0.057393
N  -4.142133 1.803994 0.785581
C  -3.382604 1.068564 -0.215575
C  -1.90052 1.529503 -0.294429
C  0.29053 0.171047 -0.100431
C  -3.200386 -0.435914 -0.004992
C  1.143343 1.296484 -0.262801
C  0.826829 -1.131648 0.085939
C  3.038591 -0.181724 -0.036052
C  2.540086 1.115572 -0.226404
C  2.221025 -1.312583 0.122918
C  -4.28411 -1.434331 0.13188
H  -3.844955 1.249979 -1.204483
H  0.720491 2.291618 -0.409814
H  0.150073 -1.980086 0.202745
H  3.220121 1.962535 -0.35827
H  2.659907 -2.306046 0.255369
H  -3.782089 1.774053 1.741434
H  -5.154929 1.696979 0.712128
H  6.057656 -0.283121 2.035579
H  -6.253052 -1.482718 -0.001929
