program: Gaussian 09
title: 000102830
version: EM64L-G09RevD.01
frameworkgroup: C1[X(C10F22O2)]
method: RPBEPBE
basis: SDD
operation: Freq
keyword: #pfreq=noraman
keyword: PBEPBE/SDD
title: #p freq=noraman PBEPBE/SDD
converged: YES YES NO NO
title: Mulliken charges:
elementType: F F F F F F F F F F F F F F F F F F F F F F O O C C C C C C C C C C
charge: -0.105277 -0.105353 -0.122560 -0.108883 -0.111413 -0.108972 -0.111441 -0.122521 -0.118655 -0.113450 -0.113323 -0.118695 -0.122568 -0.121173 -0.122553 -0.121165 -0.121119 -0.123360 -0.129560 -0.129509 -0.121120 -0.123303 -0.269848 -0.269745 0.230490 0.230934 0.376437 0.376544 0.361666 0.361594 0.204034 0.203996 0.394983 0.394886
chargesum: 0.00000
title: Mulliken charges with hydrogens summed into heavy atoms:
polarizability: 1.49572871e+02 3.09136815e+00 1.17331543e+02 2.57430163e-03 -3.08368064e-03 1.20254859e+02
1716.lowfreq: -6.5348 -1.4947 -0.0009 0.0002 0.0007 3.7306 16.1283 19.0824 19.2259
frequency: 16.1270 18.6838 19.1915 22.2767 32.5783 40.8677 50.6527 53.4953 59.9247 68.8427 70.5822 72.7563 76.6643 112.8439 113.2226 147.3841 154.8065 162.6885 187.1163 189.6719 195.3302 206.8371 207.7790 210.4554 221.8454 238.2982 246.2110 252.2257 263.6853 272.4545 277.0286 279.7793 287.7663 293.9332 296.5590 300.0657 313.5811 315.2882 333.4062 334.6999 380.5780 385.3174 398.7518 400.4239 449.0876 460.2653 460.6920 465.5444 476.8396 482.0300 493.2818 494.8274 514.2895 515.0722 537.5584 549.9927 572.2264 572.6317 614.1038 624.7513 638.7223 652.6604 663.5525 682.5981 700.1358 727.6232 858.8590 893.1224 897.6721 940.9546 982.8532 984.9415 995.0755 1000.0908 1000.4189 1028.4911 1030.5102 1039.2113 1039.8561 1049.3021 1051.7088 1060.8374 1066.0463 1073.6758 1073.7728 1083.7540 1086.6542 1097.6273 1103.5143 1124.4566 1181.4998 1185.8122 1193.6096 1193.6771 1212.2107 1213.0382
redmass: 17.8831 18.1946 18.0862 18.0584 18.2709 18.7040 18.5072 18.1441 18.1328 17.9167 18.3699 18.5815 18.2890 18.1970 17.8773 17.6574 17.8659 17.7904 17.7589 17.7976 18.2497 18.5688 18.3740 18.1667 18.6234 18.1067 18.1350 18.2625 18.4718 18.4219 18.4081 18.5634 18.6659 18.6799 18.4663 18.4579 18.4044 18.4771 18.3633 18.3401 17.7675 17.5313 17.7978 17.7296 17.4587 17.8099 17.7229 17.4960 17.1264 17.4416 17.5110 17.5097 17.5552 17.6147 17.1441 17.6116 17.2738 17.3470 16.1736 16.4995 16.5784 17.1367 17.1930 17.2760 16.9317 16.1426 13.8808 13.7769 13.9393 13.7716 13.0856 13.1831 12.8056 13.1160 13.1003 12.9193 13.4184 13.4500 13.2773 12.9182 12.9969 13.1365 12.9254 13.2912 13.3399 13.0879 13.0158 13.1889 12.8279 12.5952 12.4317 12.6293 12.4697 12.4738 12.2092 12.1865
irintensity: 0.0007 0.0004 0.0114 0.0114 0.0172 0.0158 0.0740 0.0025 0.0149 0.1551 0.0642 0.0520 0.2267 0.3639 1.9169 0.4477 0.4058 0.0790 0.0643 3.5868 2.1827 4.1897 1.3280 1.5054 0.6790 7.5587 1.4574 0.2673 0.9558 0.0043 0.7781 2.9559 0.8015 1.8307 0.0109 0.2590 0.0258 0.4643 0.2594 0.4809 5.6758 2.2034 3.7949 13.1634 38.9925 0.0066 10.2267 1.6826 8.3696 0.0006 0.1223 0.3524 3.7515 0.0907 1.7967 1.4969 23.3606 4.9356 82.1490 19.5256 28.6395 5.2810 31.9601 0.7232 20.1176 3.3584 104.2709 287.7803 20.0135 32.3283 70.4809 67.2677 83.7029 100.5653 3.3182 18.5486 62.9353 348.4837 1.3881 97.3497 57.7861 99.7829 96.9619 374.6317 572.4429 380.1404 472.8828 279.5930 441.1673 326.0799 105.3630 5.5778 15.0684 10.6664 4.8060 145.3230
temp: 298.150 k
press: 1.00000 atm
elementType: 9 9 9 9 9 9 9 9 9 9 9 9 9 9 9 9 9 9 9 9 9 9 8 8 6 6 6 6 6 6 6 6 6 6
symmnumber: 1
zpe: 315063.0 jmol-1
zpe.correction: 0.120001 hartree
zpe.thermalcorrener: 0.153961 hartree
zpe.thermalcorrenthalpy: 0.154905 hartree
zpe.thermalcorrgfe: 0.050438 hartree
zpe.sumelectzpe: -2725.314562 hartree
zpe.sumelectthermal: -2725.280602 hartree
zpe.sumelectthermalent: -2725.279658 hartree
zpe.sumelectthermalfe: -2725.384125 hartree
dipole: -0.0014 -0.0024 0.4401
dipole: 0.4401
quadrupole: -194.1345 -191.1809 -191.4020
quadrupole: -1.2497 -0.0032 -0.0052
quadrupole: -1.8953 1.0582 0.8371 -1.2497 -0.0032 -0.0052
hfenergy: -2725.434563 hartree
pointgroup: C01 [X(C10F22O2)]
dipole: 0.0010519 0.0000504 -0.1731433 debye
polarizability: 149.4593129|-3.6214501|117.4423513|0.2860578|-0.0221565|120.2576094 unknown
InChI: InChI=1S/C10F22O2/c11-1(12,5(17,18)19)9(29,30)33-3(15,7(23,24)25)4(16,8(26,27)28)34-10(31,32)2(13,14)6(20,21)22
charge 0 multiplicity 1
34 atoms
F  0.179686 1.419252 0.77946
F  -0.194225 -1.404996 0.79775
F  -0.80871 1.08453 -2.707415
F  -0.674515 2.888501 -1.343106
F  1.210482 1.758804 -1.901915
F  0.693932 -2.907478 -1.285268
F  -1.177512 -1.783111 -1.897803
F  0.858327 -1.125872 -2.675019
F  -2.44792 2.394623 0.987745
F  -2.11527 0.463482 2.121745
F  2.07869 -0.438355 2.165749
F  2.429382 -2.381624 1.058258
F  -4.768978 0.974312 1.756919
F  -4.504947 1.363877 -0.480238
F  4.738649 -0.958059 1.848975
F  4.509419 -1.364104 -0.389176
F  -5.69889 -1.15509 0.435533
F  -3.941073 -1.25342 -0.987393
F  -3.647216 -1.739986 1.21234
F  3.632593 1.753477 1.268853
F  5.692819 1.158773 0.522885
F  3.953791 1.250975 -0.923428
O  -1.776137 0.485924 -0.200819
O  1.778374 -0.485715 -0.161845
C  -0.356597 0.709741 -0.330595
C  0.361456 -0.712291 -0.313475
C  -0.145385 1.621125 -1.598241
C  0.172496 -1.643156 -1.570434
C  -2.535954 0.989894 0.880912
C  2.51982 -0.978071 0.937935
C  -4.036047 0.604317 0.611162
C  4.024316 -0.595904 0.689044
C  -4.32892 -0.912056 0.309962
C  4.324063 0.917783 0.381143
