program: Gaussian 09
title: 000102829
version: EM64L-G09RevD.01
frameworkgroup: C1[X(C18H38O)]
method: RPBEPBE
basis: SDD
operation: Freq
keyword: #pfreq=noraman
keyword: PBEPBE/SDD
title: #p freq=noraman PBEPBE/SDD
converged: YES YES NO NO
title: Mulliken charges:
elementType: O C C C C C C C C C C C C C C C C C C H H H H H H H H H H H H H H H H H H H H H H H H H H H H H H H H H H H H H H
charge: -0.468596 -0.385842 -0.386653 -0.387394 -0.386138 -0.386165 -0.386418 -0.400508 -0.385672 -0.373233 -0.384953 -0.042421 -0.381804 -0.372854 -0.353285 -0.365261 -0.725515 -0.356711 -0.696844 0.192655 0.194456 0.190764 0.193031 0.192517 0.193378 0.193033 0.193774 0.196718 0.189435 0.192824 0.193393 0.182118 0.208128 0.193445 0.192990 0.185060 0.225987 0.192848 0.192440 0.187825 0.191534 0.191828 0.189002 0.189208 0.187460 0.187549 0.204074 0.187894 0.243279 0.200625 0.208866 0.194608 0.194607 0.209614 0.209632 0.214651 0.345018
chargesum: 0.00000
title: Mulliken charges with hydrogens summed into heavy atoms:
elementType: O C C C C C C C C C C C C C C C C C C
charge: -0.123578 0.001270 -0.000759 -0.003599 0.000669 -0.000012 -0.000201 -0.010262 0.000763 0.037813 0.000336 0.145404 0.001557 0.005356 0.021725 0.026707 -0.072746 0.032503 -0.062947
polarizability: 2.67450410e+02 3.15009778e-01 1.74633024e+02 8.33354779e-01 -2.27225601e+00 1.66759694e+02
1716.lowfreq: -32.2466 -7.7511 -0.0025 0.0010 0.0017 1.5122 6.2437 14.1268 19.1021
frequency: -23.5305 8.6443 18.7305 22.6735 33.0615 42.4854 49.1080 61.1293 70.2988 87.2618 93.1294 98.9444 116.2230 122.7307 128.5731 139.6397 144.6323 146.4771 155.3993 163.4002 197.2646 208.2655 220.8361 235.7481 242.5560 252.5848 277.3079 338.5391 342.2712 401.6612 404.5701 457.8475 463.3076 502.9843 506.5813 572.4139 716.4302 717.0398 719.2278 723.8660 732.5857 747.2123 768.3687 794.5114 805.5916 838.3571 876.9525 887.1316 913.5218 918.8480 942.6303 945.9362 961.4541 974.3320 981.8786 992.4257 1001.1374 1013.3469 1020.2434 1035.1251 1038.6128 1042.9139 1059.8410 1073.6025 1076.2601 1079.8023 1082.3471 1082.7261 1085.6080 1113.8835 1121.9557 1130.0717 1145.6272 1178.3931 1189.6732 1195.0801 1203.2602 1214.6932 1220.5132 1225.3435 1237.7671 1240.4532 1255.4128 1259.1839 1270.8885 1274.8581 1277.4002 1279.6004 1283.3952 1285.9886 1290.6139 1291.8106 1294.6804 1295.0987 1297.8109 1310.7411 1325.9484 1339.6893 1344.6082 1349.6403 1352.2192 1353.7307 1355.8007 1356.5442 1358.3993 1379.5274 1387.5198 1404.9771 1456.6777 1458.2087 1458.6584 1460.2260 1461.0865 1462.7572 1463.4935 1465.2911 1467.1232 1469.2792 1473.3759 1475.0426 1477.5060 1481.1231 1482.2072 1484.7653 1486.1301 1487.3921 1488.8342 2932.9702 2947.2503 2947.4384 2948.0605 2948.4172 2949.4423 2949.7954 2950.8767 2951.8136 2954.4100 2956.9420 2958.5151 2961.4546 2964.5271 2967.8264 2968.7455 2970.9783 2976.7603 2980.2656 2981.4309 2983.5928 2986.4125 2987.8133 2991.3326 2996.3767 3002.0476 3009.0592 3016.5844 3024.0731 3031.1476 3037.4413 3042.5452 3047.6573 3065.0979 3067.4763 3069.2764 3088.4695 3579.5482
redmass: 1.8019 3.7069 3.7405 3.4020 1.9523 3.1431 3.7471 2.6388 1.9206 2.9408 3.2201 1.7767 2.6567 2.0822 2.8109 2.2401 2.2537 2.6829 2.0438 2.2959 1.3455 2.0893 1.1329 1.0910 3.6694 2.9204 3.1665 3.0604 2.9627 2.6320 2.9008 2.9846 2.9771 2.9461 2.9841 2.4813 1.0570 1.0623 1.0709 1.0852 1.1101 1.1500 1.2149 1.7420 1.5748 1.2492 1.2538 1.8946 1.4162 2.1012 1.6593 1.6872 1.3826 5.0556 4.2225 1.3175 3.5595 3.3494 1.2600 2.1992 1.2901 3.3118 2.9649 2.6707 2.5213 2.0166 2.1547 2.2203 2.4317 1.7486 2.0893 2.2630 1.6337 1.9472 1.5736 1.3213 1.4522 1.3828 1.3311 1.2145 1.3232 1.3220 1.3020 1.2944 1.2498 1.0196 1.2735 1.0329 1.2039 1.0473 1.1525 1.1031 1.2145 1.1483 1.1447 1.3601 1.4013 1.4523 1.5583 1.5252 1.7286 1.6835 1.6165 1.6405 1.6042 1.2344 1.2178 1.3459 1.0782 1.0742 1.0744 1.0717 1.0711 1.0689 1.0634 1.0803 1.0573 1.0845 1.0867 1.0439 1.0880 1.0842 1.0772 1.0914 1.0639 1.0950 1.0953 1.0579 1.0588 1.0585 1.0592 1.0589 1.0600 1.0592 1.0596 1.0602 1.0613 1.0694 1.0650 1.0594 1.0585 1.0585 1.0625 1.0366 1.0390 1.0957 1.0961 1.0970 1.1003 1.1035 1.0993 1.0998 1.1013 1.1029 1.1039 1.1044 1.1046 1.1045 1.1043 1.1025 1.0990 1.1006 1.0993 1.0993 1.0666
irintensity: 0.2089 0.0231 0.0434 0.0492 0.0618 0.1205 0.2216 0.2535 0.3868 0.0160 0.7339 0.5425 0.1624 0.1056 0.7768 0.0133 1.8088 0.2160 0.0016 5.9855 2.5226 1.2768 0.0412 154.5332 2.8541 3.1410 2.2320 0.5515 0.4358 0.6238 0.6159 0.4320 0.4648 0.2539 0.1711 4.3727 22.9305 0.4566 7.8789 0.1038 5.5910 0.8024 5.0570 1.9290 1.0171 1.9268 1.0033 4.6156 5.8768 33.6021 3.0815 34.1617 0.3785 0.3540 1.0355 1.5192 2.2397 2.7844 0.7385 0.8316 1.1458 1.6749 0.2581 1.0059 1.4601 0.0344 0.0224 0.5867 4.0839 14.3026 10.7209 2.2870 20.5673 0.1210 9.8520 22.4241 8.4584 5.5290 1.0125 2.5543 1.7956 0.3323 1.1067 0.0788 0.9190 0.0319 0.0187 0.2060 0.4200 0.2310 0.5000 0.2997 0.1690 0.1434 0.3037 0.5225 0.3203 1.1043 4.6222 0.1175 0.1593 0.6970 0.8325 0.0229 1.2646 15.7817 11.1867 2.0406 0.7283 0.0225 0.1307 0.0520 0.0951 0.1366 0.0565 1.0292 9.3435 1.3931 1.1909 12.4695 0.9255 5.2984 4.5502 2.1997 11.3764 8.9873 45.9521 42.2520 0.0335 0.0438 0.1596 0.2601 0.2310 0.1403 0.2486 0.4007 1.9831 18.1429 48.2502 10.4030 192.2437 208.6005 94.3350 37.7097 47.5412 0.4758 0.7514 1.7694 22.7570 57.6338 9.1272 5.8478 3.8183 1.9974 2.4949 0.5822 14.9007 0.3408 277.0853 203.8115 55.4360 99.8014 56.1406 32.9526 2.5915
temp: 298.150 k
press: 1.00000 atm
elementType: 8 6 6 6 6 6 6 6 6 6 6 6 6 6 6 6 6 6 6 1 1 1 1 1 1 1 1 1 1 1 1 1 1 1 1 1 1 1 1 1 1 1 1 1 1 1 1 1 1 1 1 1 1 1 1 1 1
symmnumber: 1
zpe: 1374646.8 jmol-1
zpe.correction: 0.523575 hartree
zpe.thermalcorrener: 0.549295 hartree
zpe.thermalcorrenthalpy: 0.550239 hartree
zpe.thermalcorrgfe: 0.462707 hartree
zpe.sumelectzpe: -782.314029 hartree
zpe.sumelectthermal: -782.288309 hartree
zpe.sumelectthermalent: -782.287365 hartree
zpe.sumelectthermalfe: -782.374897 hartree
dipole: -0.3416 1.2968 -1.1618
dipole: 1.7743
quadrupole: -123.9679 -118.8307 -124.9618
quadrupole: -11.7031 9.2188 2.0956
quadrupole: -1.3811 3.7561 -2.3750 -11.7031 9.2188 2.0956
hfenergy: -782.8376046 hartree
pointgroup: C01 [X(C18H38O1)]
dipole: 0.1336001 -0.441079 -0.5242901 debye
polarizability: 267.4509549|0.2978214|173.8440619|-0.8064791|3.2791175|167.548112 unknown
InChI: InChI=1S/C18H38O/c1-3-4-5-6-7-8-9-10-11-12-13-14-15-16-18(2)17-19/h18-19H,3-17H2,1-2H3
charge 0 multiplicity 1
57 atoms
O  8.402605 -1.662534 0.897351
C  1.597144 0.476707 0.267357
C  0.322794 -0.155531 -0.336539
C  2.904863 -0.058238 -0.358713
C  -0.984463 0.3913 0.280169
C  4.177982 0.571084 0.250554
C  -2.259486 -0.240981 -0.322323
C  5.486582 0.058264 -0.392896
C  -3.566318 0.313189 0.288775
C  6.749955 0.674137 0.249784
C  -4.842081 -0.316949 -0.314382
C  8.083455 0.332071 -0.466666
C  -6.148253 0.241711 0.293986
C  -7.424864 -0.384993 -0.3112
C  -8.730776 0.174925 0.296542
C  8.354755 -1.183911 -0.498798
C  9.26993 1.085864 0.178706
C  -10.007478 -0.450273 -0.311094
C  -11.30735 0.113988 0.302353
H  1.555125 1.578777 0.138653
H  1.613567 0.293198 1.362182
H  2.890591 0.130652 -1.452891
H  2.945961 -1.160866 -0.234857
H  0.311577 0.02022 -1.432829
H  0.359746 -1.256733 -0.199488
H  -1.02123 1.492261 0.141162
H  -0.972763 0.217616 1.376692
H  4.203295 0.365481 1.341047
H  4.127388 1.675304 0.144506
H  -2.268189 -0.071778 -1.419626
H  -2.225918 -1.341402 -0.178512
H  5.471577 0.287521 -1.480107
H  5.519814 -1.046333 -0.302544
H  -3.558057 0.143861 1.386021
H  -3.59878 1.413694 0.14524
H  6.64059 1.778655 0.264652
H  6.823138 0.343619 1.303828
H  -4.811573 -1.417187 -0.168458
H  -4.848845 -0.149837 -1.412015
H  7.995445 0.650388 -1.528874
H  -6.177153 1.342254 0.149899
H  -6.142621 0.073026 1.391367
H  -7.430252 -0.216464 -1.40867
H  -7.396536 -1.485563 -0.166807
H  -8.759803 1.27564 0.153625
H  -8.727953 0.004958 1.393769
H  7.551842 -1.708198 -1.058812
H  9.324528 -1.374075 -1.008602
H  9.417684 0.742639 1.217582
H  10.210721 0.908298 -0.376431
H  9.084356 2.175796 0.193469
H  -9.9770 -1.550027 -0.168768
H  -10.00956 -0.279393 -1.407155
H  -11.376255 1.207439 0.147418
H  -11.343887 -0.071939 1.392538
H  -12.204329 -0.348514 -0.149473
H  8.611364 -2.62932 0.905501
