program: Gaussian 09
title: 000102820
version: EM64L-G09RevD.01
frameworkgroup: C1[X(C9H18O2)]
method: RPBEPBE
basis: SDD
operation: Freq
keyword: #pfreq=noraman
keyword: PBEPBE/SDD
title: #p freq=noraman PBEPBE/SDD
converged: YES YES NO NO
title: Mulliken charges:
elementType: O O C C C C C C C C C H H H H H H H H H H H H H H H H H H
charge: -0.273210 -0.248374 -0.159214 -0.078174 -0.372041 -0.254556 0.244280 -0.713650 -0.690044 -0.698524 -0.693000 0.229865 0.213934 0.203254 0.221707 0.225767 0.216800 0.234871 0.217371 0.222024 0.212028 0.199812 0.240157 0.222015 0.215403 0.208697 0.227281 0.216387 0.209136
chargesum: 0.00000
title: Mulliken charges with hydrogens summed into heavy atoms:
elementType: O O C C C C C C C C C
charge: -0.273210 -0.248374 0.070651 0.135760 0.052920 0.188011 0.244280 -0.039384 -0.038048 -0.052409 -0.040196
polarizability: 1.25739524e+02 6.61583311e-01 9.76476340e+01 8.62042928e-01 -1.56547643e+00 9.07999329e+01
1716.lowfreq: -10.5239 -9.5890 -0.0004 0.0002 0.0004 3.1442 16.4618 38.9534 51.8617
frequency: 12.5797 37.7817 51.5919 87.8292 96.7704 150.0699 191.0624 203.7283 210.4091 222.5008 240.8543 252.4353 261.5916 281.0091 330.3322 386.2904 413.2757 425.9520 502.2323 633.8038 713.6008 774.4527 811.5830 837.1349 861.4934 893.4454 919.2953 926.6190 962.6104 966.8212 970.8553 1012.5439 1031.3808 1093.9960 1103.2716 1114.3081 1135.8913 1150.6144 1166.1133 1190.5810 1228.8857 1253.7306 1286.3800 1292.8161 1329.8887 1335.4507 1347.1229 1364.4753 1378.2438 1386.0935 1394.7057 1398.1511 1461.4516 1462.4407 1469.6592 1473.4775 1475.2033 1478.7396 1481.8233 1482.1332 1483.2043 1491.8534 1633.6248 2972.7715 2976.1409 2977.1702 2984.1738 2986.0816 2988.1755 2995.4925 3022.2093 3042.7909 3058.8445 3064.3940 3073.1600 3075.4672 3076.6412 3078.7102 3083.1032 3090.7098 3092.2475
redmass: 3.3957 3.6396 3.0878 2.1990 3.4094 2.1726 2.1783 1.2689 1.3787 1.1323 1.4428 1.7107 2.2706 3.1420 2.6619 2.4467 2.1260 2.7812 3.7554 2.8108 5.3341 2.1557 1.6279 2.3398 3.3056 1.4846 1.4583 1.6376 1.5533 1.4121 1.7322 1.5481 3.1170 2.4397 2.0374 2.7942 2.0283 1.7406 2.1511 1.7531 1.2727 1.2618 1.2568 1.3157 1.3997 1.4224 1.5150 1.5824 1.2132 1.2124 1.2154 1.2247 1.0717 1.0681 1.0451 1.0523 1.0644 1.0492 1.0482 1.0486 1.0586 1.0585 9.1418 1.0358 1.0375 1.0356 1.0468 1.0480 1.0770 1.0627 1.0875 1.0985 1.1061 1.0994 1.1005 1.1011 1.0993 1.0990 1.1001 1.0993 1.1002
irintensity: 0.5520 1.2828 0.0358 0.4476 0.9666 0.1823 1.9534 0.2682 0.5886 0.2328 2.8316 3.0337 2.0333 8.0172 3.8408 0.3939 1.9794 1.9196 0.8593 0.0837 3.8697 7.8815 4.4729 1.4970 11.2513 1.7587 1.1701 19.5772 17.9541 5.9405 33.6912 40.0753 1.6451 10.3846 118.9779 238.7390 2.7046 3.6332 21.8115 4.6969 2.5467 12.1131 4.0759 0.7718 4.3654 9.4865 13.0808 9.1532 22.4427 21.8076 17.1796 13.0383 6.0176 2.3278 1.1554 18.9056 5.3214 8.3096 25.6337 6.0369 19.4877 19.5702 149.5723 31.3372 18.3542 38.9338 9.3330 49.8436 8.8234 27.1019 5.4888 5.7096 4.7196 17.5003 84.2596 50.2917 41.3764 52.6938 41.7248 33.3671 37.7058
temp: 298.150 k
press: 1.00000 atm
elementType: 8 8 6 6 6 6 6 6 6 6 6 1 1 1 1 1 1 1 1 1 1 1 1 1 1 1 1 1 1
symmnumber: 1
zpe: 667854.5 jmol-1
zpe.correction: 0.254372 hartree
zpe.thermalcorrener: 0.268783 hartree
zpe.thermalcorrenthalpy: 0.269727 hartree
zpe.thermalcorrgfe: 0.211501 hartree
zpe.sumelectzpe: -503.301129 hartree
zpe.sumelectthermal: -503.286718 hartree
zpe.sumelectthermalent: -503.285774 hartree
zpe.sumelectthermalfe: -503.344000 hartree
dipole: 0.8014 0.7588 -1.5563
dipole: 1.9080
quadrupole: -61.8229 -70.0921 -72.8500
quadrupole: -2.3035 3.3652 3.2898
quadrupole: 6.4321 -1.8371 -4.5950 -2.3035 3.3652 3.2898
hfenergy: -503.555501 hartree
pointgroup: C01 [X(C9H18O2)]
dipole: 0.325204 -0.3191505 0.5965349 debye
polarizability: 125.700688|-0.6542719|97.7459085|-1.4628916|-1.3190966|90.7404945 unknown
InChI: InChI=1S/C9H18O2/c1-5-8(4)9(10)11-6-7(2)3/h7-8H,5-6H2,1-4H3
charge 0 multiplicity 1
29 atoms
O  0.38805 0.195782 0.356412
O  -0.893928 1.11564 -1.357021
C  -2.013878 0.17825 0.641756
C  2.825997 0.002678 0.385974
C  -2.944814 -0.804441 -0.124524
C  1.625984 0.531586 -0.411277
C  -0.825543 0.553149 -0.238224
C  -2.77508 1.466848 1.048476
C  2.779482 -1.53554 0.526111
C  4.134428 0.470219 -0.29619
C  -2.273013 -2.148866 -0.475507
H  -1.619671 -0.322371 1.545043
H  2.776525 0.450237 1.399137
H  -3.837847 -0.985074 0.505461
H  -3.294187 -0.303737 -1.048081
H  1.664186 1.62916 -0.542247
H  1.557919 0.06544 -1.412938
H  -3.139306 1.996406 0.150259
H  -3.644057 1.208473 1.680076
H  -2.129234 2.157958 1.619387
H  3.622813 -1.898729 1.141535
H  2.850933 -2.021341 -0.466558
H  1.837662 -1.860223 1.001008
H  5.013811 0.117902 0.272321
H  4.191579 1.572928 -0.361181
H  4.214149 0.062931 -1.322538
H  -1.408813 -2.001663 -1.149399
H  -2.983693 -2.822691 -0.987456
H  -1.909054 -2.66451 0.432888
