program: Gaussian 09
title: 000102818
version: EM64L-G09RevD.01
frameworkgroup: C1[X(C19H19N3O6)]
method: RPBEPBE
basis: SDD
operation: Freq
keyword: #p
keyword: freq=noraman
keyword: PBEPBE/SDD
title: #p freq=noraman PBEPBE/SDD
converged: YES YES NO NO
title: Mulliken charges:
elementType: O O O O O O N N N C C C C C C C C C C C C C C C C C C C H H H H H H H H H H H H H H H H H H H
charge: -0.258669 -0.289218 -0.413760 -0.241678 -0.214989 -0.210711 -0.412161 -0.436128 0.021155 -0.186329 -0.597388 0.436395 0.136248 0.252316 -0.553694 -0.416733 -0.390534 0.512575 -0.471585 -0.233967 -0.230036 -0.242388 -0.421287 -0.315772 -0.349142 -0.363123 0.393422 0.192881 0.288954 0.230375 0.283424 0.349427 0.233649 0.275538 0.347134 0.245570 0.269589 0.295282 0.257457 0.237624 0.235668 0.237148 0.246444 0.315747 0.288743 0.288184 0.378344
chargesum: 0.00000
title: Mulliken charges with hydrogens summed into heavy atoms:
elementType: O O O O O O N N N C C C C C C C C C C C C C C C C C C C
charge: -0.258669 -0.289218 -0.035416 -0.241678 -0.214989 -0.210711 -0.062734 -0.088994 0.021155 0.102625 -0.083590 0.436395 0.136248 0.252316 -0.044506 -0.171163 -0.120945 0.512575 0.081154 0.003657 0.005632 -0.005240 -0.174843 -0.000025 -0.060399 -0.074939 0.393422 0.192881
polarizability: 3.84901402e+02 4.23525836e+00 2.48352312e+02 1.86752130e+00 -3.27861184e+01 1.59959861e+02
1716.lowfreq: -4.4408 -0.0004 0.0005 0.0006 4.9007 8.0782 16.0986 22.5588 26.3528
frequency: 16.0812 22.2865 25.9208 30.1673 32.4844 35.0876 54.9941 62.5264 71.8032 80.1122 83.5541 94.9597 105.4293 119.8577 129.2970 150.8346 171.4839 193.0403 232.9524 242.1419 278.7180 305.9325 317.8030 338.9697 346.4384 369.0213 389.1029 404.2931 418.2771 432.7689 486.4648 497.2022 508.1961 508.9387 523.5297 561.6220 588.6311 606.6779 617.5895 620.9923 642.4682 649.0106 652.5406 668.1772 672.1853 684.2176 695.9204 709.3047 734.4455 742.8404 758.9958 774.2843 798.0058 820.0336 832.9855 843.7706 866.5319 880.9715 881.7465 884.9275 929.5998 943.2686 984.6463 985.3453 988.1262 989.1777 1000.8199 1002.5019 1011.0617 1012.5980 1018.2372 1027.2552 1045.1705 1080.5128 1090.8168 1096.1106 1119.8279 1126.8705 1158.2484 1163.1348 1175.2558 1180.4382 1188.8811 1190.0375 1211.7543 1220.9037 1224.9499 1240.7428 1262.7285 1273.3871 1279.5375 1300.9153 1308.2860 1323.2373 1335.2888 1351.0877 1361.2488 1378.5546 1380.4938 1398.4469 1427.3110 1442.4020 1443.3339 1454.1321 1461.5306 1476.3802 1483.2915 1488.1847 1528.8765 1588.1362 1590.1706 1599.7024 1610.9524 1613.4450 1625.4637 1663.4677 2984.8724 2990.2753 2996.8315 3009.4018 3047.8101 3071.9883 3075.4076 3120.6817 3122.2955 3133.4444 3137.7507 3149.7298 3167.0502 3179.6488 3186.3954 3203.2708 3459.3739 3477.3968 3513.1676
redmass: 7.3608 6.1749 8.1616 5.9490 6.7411 6.9008 5.6796 6.3385 4.8559 5.7418 3.7005 5.9547 4.5357 4.0592 5.3766 7.6604 6.2213 6.1704 7.5618 6.1664 5.2983 5.3567 5.1291 5.0978 2.8945 4.3125 7.4986 2.8505 3.0201 5.0980 3.4289 2.9136 3.4931 5.4019 2.4048 4.0763 5.5083 3.4173 6.1659 6.4432 3.9349 2.7022 2.2194 4.1559 1.5207 1.2713 2.7068 2.0556 3.5503 4.1104 1.7598 5.5452 1.8605 3.8862 4.8587 1.3388 1.2502 1.7486 2.6464 4.5123 1.7483 2.7937 1.3493 2.0473 1.9022 4.4568 3.1357 1.3827 1.3927 2.6469 2.3306 2.2058 3.3620 1.6023 2.4926 3.0369 1.3436 2.6352 1.1657 1.3895 1.0611 1.5692 1.9906 1.1232 1.9797 2.0279 4.1566 1.3302 1.3359 2.0274 1.5528 1.3655 1.3376 1.4096 1.3056 2.0697 3.7412 2.7044 3.9050 6.1363 4.7045 2.1636 1.0736 1.1019 1.1732 2.2780 2.2899 2.5504 2.3152 6.4339 7.0252 6.5583 5.8327 4.7189 4.5977 8.0993 1.0816 1.0633 1.0624 1.0603 1.0982 1.1043 1.0963 1.0887 1.0875 1.0912 1.0906 1.0956 1.1013 1.0907 1.0946 1.0960 1.0771 1.0779 1.0639
irintensity: 0.3331 0.6117 0.7934 0.6095 1.6436 0.2781 0.0466 1.3434 1.6876 3.8356 1.8746 6.2580 2.7332 5.8038 0.1025 4.5627 7.8200 13.3552 14.3768 3.1199 0.2366 6.1731 2.0099 0.1952 5.4334 1.9830 54.6408 0.0470 0.0675 26.1946 9.6049 44.8768 5.6269 2.3181 21.3997 45.3387 3.4104 26.8433 0.4624 2.1176 21.7598 16.6974 102.8247 7.8773 123.2415 19.7731 24.2316 38.9457 11.0777 15.2129 38.1505 37.0266 9.4327 5.7719 1.2951 19.5888 0.4742 70.2408 32.7157 3.7753 2.9111 22.2083 1.1738 0.0907 0.5571 0.0935 0.2392 1.3347 0.5247 3.6881 59.3644 5.3240 277.4603 18.6436 63.2826 21.9765 17.4470 19.0477 2.4554 6.7468 2.2042 296.6748 8.1106 0.5585 7.8919 21.4648 437.2511 32.7689 64.9711 43.7004 7.8544 36.0999 26.5450 8.0648 7.7061 40.1090 90.2347 75.8492 22.9458 236.5867 49.4661 5.8419 9.5509 49.9411 115.4739 660.3057 13.6645 22.1787 315.0033 69.5735 112.1962 127.2661 9.6564 100.4662 86.4622 203.8646 22.1683 6.2683 40.9227 16.3160 9.6002 5.3721 9.4704 2.1717 4.8536 8.5627 4.6553 24.6123 18.6709 1.9739 2.8738 3.3402 125.5311 132.1989 26.9044
temp: 298.150 k
press: 1.00000 atm
elementType: 8 8 8 8 8 8 7 7 7 6 6 6 6 6 6 6 6 6 6 6 6 6 6 6 6 6 6 6 1 1 1 1 1 1 1 1 1 1 1 1 1 1 1 1 1 1 1
symmnumber: 1
zpe: 939981.4 jmol-1
zpe.correction: 0.358020 hartree
zpe.thermalcorrener: 0.384112 hartree
zpe.thermalcorrenthalpy: 0.385056 hartree
zpe.thermalcorrgfe: 0.296381 hartree
zpe.sumelectzpe: -1348.970980 hartree
zpe.sumelectthermal: -1348.944888 hartree
zpe.sumelectthermalent: -1348.943944 hartree
zpe.sumelectthermalfe: -1349.032619 hartree
dipole: -3.3109 3.5181 -0.6863
dipole: 4.8796
quadrupole: -215.7223 -160.8430 -164.1914
quadrupole: 31.6278 7.5498 0.0815
quadrupole: -35.4701 19.4092 16.0609 31.6278 7.5498 0.0815
hfenergy: -1349.3289997 hartree
pointgroup: C01 [X(C19H19N3O6)]
dipole: 1.2563275 1.4011371 0.3794144 debye
polarizability: 385.0343206|0.4130545|242.4486525|0.1941939|39.4208077|165.7306016 unknown
InChI: InChI=1S/C19H19N3O6/c23-17(10-11-18(24)25)21-16(12-13-4-2-1-3-5-13)19(26)20-14-6-8-15(9-7-14)22(27)28/h1-9,16,20-21,24H,10-12H2
charge 0 multiplicity 1
47 atoms
O  0.218941 -1.816523 -0.789999
O  3.912103 0.954744 0.706778
O  8.364527 -1.578429 0.977453
O  7.65892 -1.427939 -1.228212
O  -7.368122 -1.424517 0.442707
O  -6.606404 -3.413225 -0.380131
N  2.499812 -0.52014 -0.384532
N  -1.115807 -0.120613 0.144612
N  -6.418397 -2.204574 0.038369
C  1.308006 0.266807 -0.073581
C  1.230556 1.575696 -0.947538
C  0.270074 2.620128 -0.397866
C  0.09122 -0.663385 -0.275733
C  3.748651 -0.118861 0.038189
C  4.912378 -1.01946 -0.382031
C  -0.909759 2.985825 -1.098008
C  0.547775 3.252501 0.845733
C  -2.411956 -0.689062 0.08852
C  6.08189 -0.916205 0.612049
C  -1.793794 3.956193 -0.57054
C  -0.335281 4.219724 1.375256
C  -1.510834 4.573299 0.670081
C  -3.494894 0.128298 0.524675
C  -2.660961 -2.014676 -0.367533
C  -4.807904 -0.362713 0.510717
C  -3.977645 -2.506439 -0.381088
C  -5.037284 -1.68146 0.055943
C  7.399204 -1.328807 -0.007691
H  1.366847 0.585555 0.986908
H  0.975641 1.301953 -1.987331
H  2.256796 1.984233 -0.943577
H  2.335885 -1.419941 -0.851673
H  4.579509 -2.06707 -0.500404
H  5.267474 -0.69036 -1.3786
H  -1.070163 0.85005 0.476569
H  -1.131905 2.514527 -2.063327
H  1.472196 3.000774 1.380918
H  6.166171 0.137975 0.945842
H  5.909546 -1.50937 1.526585
H  -2.694811 4.233482 -1.128893
H  -0.102535 4.704526 2.329742
H  -2.191791 5.328318 1.077894
H  -3.30009 1.151047 0.869308
H  -1.827501 -2.632648 -0.703738
H  -5.652889 0.246746 0.84026
H  -4.197575 -3.52045 -0.725147
H  9.228482 -1.808134 0.538463
