program: Gaussian 09
title: 000102812
version: EM64L-G09RevD.01
frameworkgroup: C1[X(C8H9BrO)]
method: RPBEPBE
basis: SDD
operation: Freq
keyword: #p
keyword: freq=noraman
keyword: PBEPBE/SDD
title: #p freq=noraman PBEPBE/SDD
converged: YES YES NO NO
title: Mulliken charges:
elementType: Br O C C C C C C C C H H H H H H H H H
charge: -0.018794 -0.422882 -0.157756 0.377002 -0.711901 -0.373462 -0.360736 -0.220697 -0.234112 -0.237936 0.252634 0.308055 0.270413 0.272928 0.222431 0.228397 0.227478 0.230573 0.348364
chargesum: 0.00000
title: Mulliken charges with hydrogens summed into heavy atoms:
elementType: Br O C C C C C C C C
charge: -0.018794 -0.074518 0.094878 0.377002 -0.133433 -0.100535 -0.138304 0.007700 -0.006634 -0.007363
polarizability: 1.13473574e+02 4.66232338e+00 9.81328018e+01 9.51043183e+00 -3.63620916e+00 8.06805812e+01
1716.lowfreq: -21.6876 -9.8295 -4.4627 -0.0005 -0.0005 -0.0004 16.6787 56.3557 137.2039
frequency: 14.6474 56.3359 137.2021 168.4125 215.6244 330.0553 382.6368 406.0208 411.2117 445.5756 504.1425 535.1626 615.5043 668.3405 703.6668 728.4388 799.4831 847.2810 853.0219 927.0951 946.9503 979.6695 989.6329 999.7034 1025.2668 1035.9330 1086.2803 1119.9049 1172.6562 1191.0268 1202.8894 1208.9111 1249.2570 1297.8200 1317.8676 1354.6586 1381.0709 1431.7525 1437.8770 1482.4241 1592.2718 1613.1964 2976.5266 3064.7614 3123.8994 3131.2775 3143.8157 3149.5353 3155.8571 3167.1499 3509.3382
redmass: 4.3048 7.4583 6.2526 4.7446 3.8128 3.1204 1.3825 2.7534 2.6905 3.7089 3.9512 4.6445 6.4117 3.9520 1.9263 2.2358 2.2369 2.0843 1.3374 1.4393 2.0577 1.4092 5.7072 1.3189 2.5686 2.4661 1.5446 1.2485 1.0535 1.1163 1.3171 1.6765 1.4788 1.5933 1.3246 1.1775 7.6457 1.4729 1.4850 2.2392 6.1871 6.0653 1.0815 1.0575 1.0846 1.0880 1.0943 1.1081 1.0956 1.1009 1.0653
irintensity: 0.3713 0.3227 2.6656 0.1835 2.2012 3.1200 111.4359 5.2784 26.0174 11.2411 83.1654 19.2284 0.2576 4.4571 45.3958 35.0272 27.1585 12.1593 1.2962 5.8272 38.2073 0.8143 0.7509 0.4122 12.6975 41.6828 3.2327 11.9848 0.3603 2.6406 2.5393 21.3791 30.1841 42.3911 0.9647 31.3912 1.1923 3.8344 32.7199 10.9269 0.4718 1.8726 8.4346 16.5152 3.2284 5.0367 30.8212 2.8652 24.5263 16.2023 10.1362
temp: 298.150 k
press: 1.00000 atm
elementType: 35 8 6 6 6 6 6 6 6 6 1 1 1 1 1 1 1 1 1
symmnumber: 1
zpe: 390515.2 jmol-1
zpe.correction: 0.148739 hartree
zpe.thermalcorrener: 0.158289 hartree
zpe.thermalcorrenthalpy: 0.159233 hartree
zpe.thermalcorrgfe: 0.111149 hartree
zpe.sumelectzpe: -398.184445 hartree
zpe.sumelectthermal: -398.174895 hartree
zpe.sumelectthermalent: -398.173951 hartree
zpe.sumelectthermalfe: -398.222035 hartree
dipole: -1.0224 -0.7020 1.2613
dipole: 1.7689
quadrupole: -66.9285 -71.8348 -63.6312
quadrupole: 2.4912 4.5503 -2.2541
quadrupole: 0.5363 -4.3700 3.8337 2.4912 4.5503 -2.2541
hfenergy: -398.3331843 hartree
pointgroup: C01 [X(C8H9Br1O1)]
dipole: -0.485812 -0.4971037 -0.034885 debye
dipolederiv: -0.1702447 -0.0125234 0.0758182 -0.0863919 -0.2591573 0.1769306 0.1467404 0.0972916 -0.3907494 -0.8160981 -0.0437721 -0.0248666 -0.0466294 -0.4273016 -0.2581342 0.0012718 -0.2238555 -0.377252 0.6502901 0.0534483 0.0228026 0.0337192 0.3101851 0.3216598 0.0791063 0.1305356 0.2113742 0.0297401 -0.0390477 -0.0217873 -0.0988145 -0.0536891 -0.0245752 0.0815516 -0.0469791 -0.0870839 0.0228892 0.0786213 -0.0656985 0.1439462 0.2997811 -0.4120899 -0.2305363 -0.3471033 0.4478527 -0.1315314 0.0273943 0.1008968 0.0355858 -0.1042374 0.0587646 0.0260369 0.072467 -0.0197482 -0.1162943 -0.057034 -0.0476767 -0.025767 -0.0538859 0.0860627 -0.0440755 0.0970117 -0.0145031 -0.0251398 -0.0806909 -0.0349798 -0.0784199 -0.0084378 0.1301006 -0.0300857 0.126386 -0.0230544 -0.0298096 0.0115523 0.093009 0.0417267 -0.0706168 0.0941246 0.1026072 0.0965911 0.0025874 0.0686026 -0.0627349 0.0495685 -0.0691591 -0.1063787 0.033007 0.0241147 0.033388 -0.0999157 -0.0409553 0.0097194 0.0184002 0.0524404 -0.0150971 -0.0188631 -0.0098737 0.107154 -0.0416614 -0.0701946 0.0439215 0.0199132 0.022934 0.0260311 0.0967721 -0.0135812 0.0947526 0.0007704 0.1047119 -0.1095792 -0.0340633 -0.0982232 -0.0734312 0.0021518 0.0099193 0.0046218 -0.0314636 0.0995832 -0.0306016 -0.0808405 -0.0220138 0.0999451 -0.0651047 -0.0666977 -0.0670002 0.0459354 0.0676043 0.0944082 0.0466045 0.0816859 0.0248743 -0.1087978 0.0660665 -0.1002658 0.024342 0.036818 0.0720206 0.0444218 0.0820001 0.0260501 -0.1217033 0.0514245 -0.118177 0.0352468 0.0151543 -0.031893 -0.0849287 -0.0354071 0.0851192 -0.0961135 -0.1043451 -0.0969194 0.0018494 -0.1120451 0.0661228 -0.0348559 0.0726894 0.1136437 -0.027608 -0.0418773 -0.0246919 0.1144609 0.4169195 0.010668 -0.0417375 -0.0059018 0.1866032 0.1334159 -0.0477667 0.1647929 0.2010127 unknown
polarizability: 114.2402829|-7.9780749|82.8123864|-1.3572539|8.865195|95.2342873 unknown
InChI: InChI=1S/C8H9BrO/c9-6-8(10)7-4-2-1-3-5-7/h1-5,8,10H,6H2
charge 0 multiplicity 1
19 atoms
Br 2.527147 0.249014 -2.108896
O  2.241131 0.384213 1.215189
C  1.492417 -0.67014 0.518523
C  0.035401 -0.266944 0.248748
C  2.288256 -1.188387 -0.688048
C  -0.573116 0.690551 1.099629
C  -0.740579 -0.859518 -0.779344
C  -1.92656 1.053975 0.922128
C  -2.094637 -0.497398 -0.956399
C  -2.69326 0.460639 -0.106702
H  1.498018 -1.501799 1.254605
H  3.313928 -1.444861 -0.385861
H  1.807453 -2.032788 -1.203769
H  0.025924 1.142247 1.89695
H  -0.298182 -1.596367 -1.459004
H  -2.381088 1.797537 1.586527
H  -2.678981 -0.958582 -1.760476
H  -3.742922 0.742011 -0.246693
H  2.344853 1.147896 0.586892
