program: Gaussian 09
title: 000102810
version: EM64L-G09RevD.01
frameworkgroup: C1[X(C10H13NO)]
method: RPBEPBE
basis: SDD
operation: Freq
keyword: #p
keyword: freq=noraman
keyword: PBEPBE/SDD
title: #p freq=noraman PBEPBE/SDD
converged: YES YES NO NO
title: Mulliken charges:
elementType: O N C C C C C C C C C C H H H H H H H H H H H H H
charge: -0.457507 -0.159032 -0.429999 -0.415157 -0.197454 0.446454 -0.368155 -0.398398 -0.406739 -0.231337 -0.233496 -0.244248 0.237394 0.217607 0.227928 0.239639 0.198037 0.208725 0.218352 0.272323 0.256954 0.350545 0.221417 0.221844 0.224301
chargesum: 0.00000
title: Mulliken charges with hydrogens summed into heavy atoms:
elementType: O N C C C C C C C C C C
charge: -0.106962 -0.159032 0.025002 0.052409 0.000583 0.446454 0.058922 -0.126075 -0.149785 -0.009920 -0.011651 -0.019947
polarizability: 1.43627945e+02 -1.88865448e+00 1.07513757e+02 3.72891463e+00 1.38974715e+01 8.50354352e+01
1716.lowfreq: -9.2069 -0.0005 0.0002 0.0004 7.0911 10.8181 38.1663 70.4353 82.8925
frequency: 37.9355 70.4154 82.8882 131.4358 140.4517 159.1452 177.0503 267.8160 300.7483 361.7501 404.9428 416.0591 430.1802 541.9366 602.5776 616.3106 707.0011 754.2982 764.4985 781.3385 825.0757 833.6755 858.4471 925.0532 968.1508 974.4322 982.0103 984.7406 990.2230 996.6872 1014.1155 1030.7095 1048.6754 1070.8800 1079.1083 1082.9986 1124.7732 1141.7946 1170.1480 1182.8638 1186.9792 1200.6318 1236.2414 1259.4138 1298.1051 1307.1783 1344.8403 1384.9610 1392.4440 1439.4803 1457.9303 1468.3606 1473.9347 1483.2311 1592.4671 1614.2102 2878.4837 2957.8560 3028.0016 3053.9410 3068.1549 3118.8810 3129.4081 3144.6356 3154.1992 3163.5767 3165.8063 3183.7800 3592.2507
redmass: 3.9913 3.3769 3.4683 1.3982 2.2209 3.1774 2.9708 3.3398 3.8145 4.7356 2.8787 3.2166 4.4759 3.0714 4.0223 6.3860 1.8054 1.9194 1.9520 2.4009 4.3730 2.2208 1.2490 1.3752 1.4820 4.0375 1.4673 1.9555 5.3500 1.3176 1.9477 1.8138 1.9064 1.2560 1.5093 1.3336 1.8608 1.4117 1.0562 1.1733 1.1770 1.7916 1.4409 2.7170 1.2812 1.5229 1.4844 4.5333 1.5050 2.1438 1.0808 1.1152 1.1867 2.1798 6.1827 6.0927 1.0813 1.0572 1.1063 1.0528 1.0597 1.0844 1.0884 1.0929 1.0954 1.1006 1.1147 1.1157 1.0669
irintensity: 0.2818 1.0818 1.6274 137.1388 21.3214 1.1190 7.9470 0.1699 0.8490 2.3245 0.3260 2.9389 4.4620 27.2191 3.7677 0.0615 55.3332 3.7767 32.7688 12.7905 3.8541 12.5160 0.2200 3.0173 15.6489 77.2949 8.2596 23.4870 0.5020 1.6731 7.8906 5.7513 8.9040 6.0476 8.4825 12.0986 7.8483 0.2222 0.2927 1.1252 8.1459 10.1904 26.3917 20.1469 13.5579 8.9587 11.6179 0.9925 4.9367 12.7032 4.4776 4.9365 4.1466 19.6546 1.1137 5.3307 38.9094 64.5027 48.9016 35.2629 25.7415 0.2742 12.3426 27.6096 23.6706 16.3941 3.0683 36.1795 5.0596
temp: 298.150 k
press: 1.00000 atm
elementType: 8 7 6 6 6 6 6 6 6 6 6 6 1 1 1 1 1 1 1 1 1 1 1 1 1
symmnumber: 1
zpe: 543180.7 jmol-1
zpe.correction: 0.206887 hartree
zpe.thermalcorrener: 0.218585 hartree
zpe.thermalcorrenthalpy: 0.219530 hartree
zpe.thermalcorrgfe: 0.168419 hartree
zpe.sumelectzpe: -517.867796 hartree
zpe.sumelectthermal: -517.856098 hartree
zpe.sumelectthermalent: -517.855153 hartree
zpe.sumelectthermalfe: -517.906264 hartree
dipole: -1.0898 0.4535 -0.3327
dipole: 1.2264
quadrupole: -64.8676 -66.6013 -70.7353
quadrupole: -0.2739 -0.0274 -2.9882
quadrupole: 2.5338 0.8001 -3.3339 -0.2739 -0.0274 -2.9882
hfenergy: -518.074683 hartree
pointgroup: C01 [X(C10H13N1O1)]
dipole: 0.4193742 0.1896628 0.144811 debye
dipolederiv: -0.5881244 0.0268428 0.0448299 0.0486326 -0.7940465 0.129091 0.0018731 0.2243927 -0.2057659 -0.5521935 0.2863945 0.1409487 0.3446018 -0.4149335 -0.0618345 0.2387503 -0.0861359 -0.3700933 0.0801562 -0.1020079 0.0181263 -0.13246 0.0819989 -0.0731101 -0.0210622 -0.063583 0.1868744 0.0886042 -0.0733189 -0.0466543 -0.1074701 0.1504963 -0.0831112 -0.0828206 -0.0553788 0.1286613 0.4680512 -0.1835725 -0.0787626 -0.29666 0.2939864 -0.0042891 -0.0684668 -0.1045221 0.1996536 0.2245911 0.1216948 0.0318393 0.1369125 -0.0864407 -0.0315164 0.0404624 -0.0022463 -0.0516099 0.281777 -0.1426892 -0.0109918 -0.0324126 0.6174315 -0.0699412 -0.0093511 -0.0898257 0.2412956 -0.1008247 -0.0567578 0.0428171 -0.07528 -0.0774218 -0.0630797 0.0453949 -0.0617232 -0.0810057 -0.1407497 0.0474123 -0.01654 0.0583249 0.0286401 -0.0968072 -0.0012571 -0.0804047 -0.0895997 -0.0260249 0.0525039 -0.0244511 0.0677003 0.009353 -0.1385466 -0.030795 -0.127688 -0.0495104 0.0128541 -0.047111 0.0808974 -0.0594335 -0.0504923 -0.11422 0.0681146 -0.0950371 -0.0468817 0.0606492 0.0411429 0.008836 0.0456088 -0.1044837 -0.0506087 0.006708 -0.0522368 -0.1249899 -0.1155201 0.0315785 -0.0644783 0.024161 0.0791272 0.0475239 -0.1078023 0.0501962 0.0339993 0.0019002 -0.008583 -0.003801 -0.0723014 -0.018772 0.126044 0.0837475 0.1046449 0.0029879 0.091187 0.0087514 -0.0868494 0.0108847 0.0281765 0.0499408 -0.067493 -0.0357942 -0.1043086 0.1088713 -0.0255838 -0.014929 0.0220042 -0.1336876 0.0031642 -0.0165368 0.0393881 0.0533359 -0.066001 0.004027 0.0553032 0.0370738 -0.0241413 0.0375562 0.0225141 0.1050781 -0.1592431 -0.2516816 0.0014372 -0.0757794 -0.0679621 -0.0159574 0.0158805 -0.0609516 0.0202802 0.0463589 0.0308306 0.0291409 0.1085705 0.023887 -0.0028003 0.0669429 0.0758408 0.0526931 -0.1136494 0.0944877 0.054984 -0.0725947 0.0706039 0.0658399 0.0597071 -0.0797453 0.0644162 0.080882 0.0780864 -0.0514354 0.0472651 -0.044725 0.0226627 0.0972739 0.0384025 0.0911577 0.0746083 0.3488901 0.0389383 -0.0248115 0.0592428 0.2000092 -0.1125354 -0.019867 -0.1608108 0.1172568 0.0415877 -0.059404 0.0335345 -0.077546 -0.0138051 0.1299287 0.0462119 0.1292231 0.0496937 -0.0270026 0.0630994 -0.0865596 0.0764119 0.0542317 0.1017178 -0.0944368 0.0994055 0.0512107 -0.1444012 -0.0574845 -0.0057652 -0.0597995 0.1050286 0.034829 -0.0074346 0.0345107 0.1298391 unknown
polarizability: 143.2182447|3.2958849|108.1065863|5.7189618|-13.3208595|84.8523062 unknown
InChI: InChI=1S/C10H13NO/c12-8-10(11-6-7-11)9-4-2-1-3-5-9/h1-5,10,12H,6-8H2
charge 0 multiplicity 1
25 atoms
O  0.911448 2.857347 0.178376
N  1.971921 -0.683126 0.373168
C  3.360825 -0.741567 -0.214106
C  2.288779 -1.718784 -0.674595
C  1.130262 0.461496 -0.088975
C  -0.349484 0.082877 -0.09137
C  1.422276 1.652432 0.852427
C  -0.837609 -0.969584 0.724048
C  -1.262451 0.816357 -0.889723
C  -2.215631 -1.283073 0.737648
C  -2.640603 0.504868 -0.873745
C  -3.122511 -0.547617 -0.060546
H  4.150046 -1.071218 0.468397
H  3.654923 0.046429 -0.922469
H  1.872892 -1.575133 -1.681004
H  2.300235 -2.754763 -0.322527
H  1.415797 0.800136 -1.116403
H  2.518159 1.735202 1.007573
H  0.929211 1.482977 1.830042
H  -0.127454 -1.534152 1.337194
H  -0.889531 1.639659 -1.508395
H  0.773096 3.576771 0.841787
H  -2.58168 -2.101607 1.368503
H  -3.336605 1.080712 -1.494685
H  -4.190911 -0.792539 -0.050819
