program: Gaussian 09
title: 000102808
version: EM64L-G09RevD.01
frameworkgroup: C1[X(C14H15NO4)]
method: RPBEPBE
basis: SDD
operation: Freq
keyword: #p
keyword: freq=noraman
keyword: PBEPBE/SDD
title: #p freq=noraman PBEPBE/SDD
converged: YES YES NO NO
title: Mulliken charges:
elementType: O O O O N C C C C C C C C C C C C C C H H H H H H H H H H H H H H H
charge: -0.414893 -0.193783 -0.182742 -0.197926 -0.295030 -0.092844 -0.453094 -0.026516 0.079671 0.124423 -0.720169 -0.715458 0.183742 0.180708 0.170354 -0.354265 -0.349972 -0.211002 -0.210216 0.281405 0.279045 0.204310 0.200717 0.215797 0.219611 0.216394 0.221879 0.227610 0.214011 0.270212 0.271266 0.239443 0.239532 0.377781
chargesum: 0.00000
title: Mulliken charges with hydrogens summed into heavy atoms:
elementType: O O O O N C C C C C C C C C C C C C C
charge: -0.037112 -0.193783 -0.182742 -0.197926 -0.295030 0.188561 0.030262 0.174201 0.079671 0.124423 -0.068368 -0.051958 0.183742 0.180708 0.170354 -0.084053 -0.078706 0.028442 0.029316
polarizability: 2.26555384e+02 1.03670357e+00 1.71197654e+02 4.36698100e+00 3.93307714e+00 1.08169879e+02
1716.lowfreq: -25.5066 -6.0081 0.0002 0.0004 0.0007 0.9472 3.0726 32.3060 36.4874
frequency: -25.4270 32.1683 36.4753 53.8280 83.6282 109.9139 129.9979 138.4956 168.6271 180.8541 183.1971 238.1890 245.9186 255.3231 265.5775 330.4365 339.4244 357.5761 371.2609 382.0837 414.7346 453.7901 510.3869 522.3592 543.2657 581.6449 601.8905 644.5668 658.3042 683.8456 695.1878 710.4461 748.8596 775.1871 787.9997 794.1466 803.1188 859.4790 907.8008 908.8297 927.5240 951.5273 963.4975 967.9490 975.8166 1007.0194 1010.5101 1020.6854 1037.0910 1058.6221 1075.8389 1117.6618 1146.4595 1167.8415 1172.1035 1198.8391 1204.3450 1222.1336 1254.3412 1283.1782 1302.3258 1310.2183 1321.7644 1345.5099 1355.1357 1381.2547 1389.8311 1400.4306 1416.0060 1454.1024 1455.4996 1465.0787 1466.6373 1483.8224 1486.7142 1497.6797 1616.0706 1618.0487 1632.2755 1669.2283 1683.7369 2964.8062 2971.8593 2977.6305 2997.5774 3052.5829 3065.0148 3067.8318 3071.8955 3074.6248 3079.0115 3139.7002 3153.4834 3165.2813 3174.8299 3500.4712
redmass: 5.9848 3.7722 5.1873 6.7814 3.6539 4.0976 7.3086 5.3798 4.4536 5.1460 3.8970 1.6170 2.5173 1.4518 2.4225 6.8218 7.1775 2.3230 2.7838 2.7176 3.2696 4.8729 3.7113 6.6567 3.4284 4.6897 3.0036 2.0690 4.7962 6.3644 3.7368 3.1578 4.0335 3.9901 5.0237 1.8430 2.6004 5.2813 1.3986 1.5722 1.7724 2.1868 2.2748 1.8450 1.4122 1.3475 2.2536 2.4016 2.4977 3.0118 2.7334 1.7220 2.3972 1.2577 1.8879 2.0331 2.9097 1.3265 1.4260 1.4975 1.5849 3.6749 1.9001 1.4074 1.3532 1.2215 1.4112 1.2144 6.6300 2.4705 2.7351 1.0614 1.0683 1.0529 1.0520 1.0514 7.8436 7.7260 11.7861 9.4970 10.6781 1.0820 1.0356 1.0358 1.0653 1.0868 1.0995 1.0992 1.0985 1.0971 1.0991 1.0865 1.0906 1.0956 1.1004 1.0640
irintensity: 1.2082 0.3166 1.4835 1.8771 1.3386 0.5969 3.3590 0.2647 1.0821 0.4136 0.6208 0.5468 0.9068 0.4084 0.6062 4.4791 10.4757 0.8271 0.6504 3.2084 3.8840 0.0342 25.8767 8.6523 1.0659 13.3298 26.2199 146.7084 0.3885 3.9132 47.7945 78.0955 5.6051 1.9455 0.3334 32.6052 3.4109 17.3803 0.0297 4.5923 5.6872 2.5805 7.5909 1.6832 1.9558 0.0005 20.0021 97.1401 196.6236 42.1269 2.1361 13.1464 10.7083 7.8831 3.4250 13.4764 4.9157 5.7649 6.3977 0.5016 22.0652 298.2396 85.2082 25.3527 7.7379 18.1911 30.9843 10.0370 11.4025 11.7994 0.3943 5.8026 10.1036 7.9027 16.5791 18.6971 10.2058 40.3903 276.0124 189.6445 74.7015 21.0239 28.4249 26.7351 23.1840 7.6941 12.9855 18.0039 94.4685 12.9660 32.9352 1.8706 5.4082 5.3542 21.3792 23.9965
temp: 298.150 k
press: 1.00000 atm
elementType: 8 8 8 8 7 6 6 6 6 6 6 6 6 6 6 6 6 6 6 1 1 1 1 1 1 1 1 1 1 1 1 1 1 1
symmnumber: 1
zpe: 696703.8 jmol-1
zpe.correction: 0.265360 hartree
zpe.thermalcorrener: 0.282487 hartree
zpe.thermalcorrenthalpy: 0.283432 hartree
zpe.thermalcorrgfe: 0.219868 hartree
zpe.sumelectzpe: -896.782569 hartree
zpe.sumelectthermal: -896.765442 hartree
zpe.sumelectthermalent: -896.764498 hartree
zpe.sumelectthermalfe: -896.828061 hartree
dipole: -2.1204 0.8689 -0.6969
dipole: 2.3951
quadrupole: -81.4403 -124.9733 -107.4520
quadrupole: 1.9153 1.2816 4.0010
quadrupole: 23.1816 -20.3514 -2.8301 1.9153 1.2816 4.0010
hfenergy: -897.0479297 hartree
pointgroup: C01 [X(C14H15N1O4)]
dipole: -0.8397532 0.4055341 -0.1353252 debye
polarizability: 226.6305489|0.3969031|161.6027603|3.1679069|23.0200152|117.6896069 unknown
InChI: InChI=1S/C14H15NO4/c1-8(2)7-11(14(18)19)15-12(16)9-5-3-4-6-10(9)13(15)17/h3-6,8,11,18H,7H2,1-2H3
charge 0 multiplicity 1
34 atoms
O  2.490896 0.262361 2.298759
O  -0.416057 2.254284 0.905468
O  -0.265874 -2.052721 -1.035279
O  1.88042 -1.827531 1.489608
N  0.032608 0.102425 -0.017725
C  1.506123 0.205933 0.08962
C  2.222846 -0.241566 -1.213346
C  3.703539 0.212349 -1.363699
C  -0.82048 1.165255 0.431515
C  -0.725961 -0.999989 -0.536859
C  3.864163 1.752009 -1.326583
C  4.667123 -0.469869 -0.360941
C  -2.218659 0.691561 0.198733
C  -2.162963 -0.599431 -0.376662
C  1.959776 -0.594898 1.324227
C  -3.442105 1.326372 0.462337
C  -3.330287 -1.30331 -0.708323
C  -4.629096 0.621994 0.133631
C  -4.573828 -0.673114 -0.442734
H  1.70243 1.271886 0.297035
H  2.151631 -1.339685 -1.302901
H  1.642637 0.189261 -2.053203
H  3.997242 -0.126849 -2.379624
H  3.177243 2.248584 -2.037607
H  3.664983 2.15902 -0.317333
H  4.89696 2.040761 -1.595625
H  4.520987 -0.085265 0.665042
H  4.524958 -1.566021 -0.344394
H  5.717848 -0.266505 -0.639209
H  -3.471122 2.326323 0.9062
H  -3.274421 -2.302009 -1.152507
H  -5.603878 1.082373 0.326945
H  -5.50698 -1.192857 -0.684957
H  2.7709 -0.272632 3.09169
