program: Gaussian 09
title: 000102792
version: EM64L-G09RevD.01
frameworkgroup: C1[X(C6H10FNO4)]
method: RPBEPBE
basis: SDD
operation: Freq
keyword: #p
keyword: freq=noraman
keyword: PBEPBE/SDD
title: #p freq=noraman PBEPBE/SDD
converged: YES YES NO NO
title: Mulliken charges:
elementType: F O O O O N C C C C C C H H H H H H H H H H
charge: -0.208759 -0.284281 -0.410010 -0.230697 -0.202200 -0.603050 -0.433951 -0.158691 -0.048909 0.189236 0.232073 -0.501998 0.246677 0.221809 0.269504 0.229405 0.302315 0.271995 0.386822 0.252476 0.235105 0.245127
chargesum: 0.00000
title: Mulliken charges with hydrogens summed into heavy atoms:
elementType: F O O O O N C C C C C C
charge: -0.208759 -0.284281 -0.023188 -0.230697 -0.202200 -0.028739 0.034535 0.110813 0.180496 0.189236 0.232073 0.230711
polarizability: 9.41615582e+01 -1.34043754e+00 8.53266584e+01 7.32182361e+00 5.47475165e+00 7.11320540e+01
1716.lowfreq: -11.1931 -6.3541 -0.0008 -0.0001 0.0004 7.4701 24.9468 56.8750 70.2851
frequency: 24.6307 56.8458 70.2831 84.9307 95.8903 113.3366 156.0204 187.0741 215.3559 237.1440 282.3705 290.2437 309.5291 325.6739 425.4005 459.5432 495.4067 507.6496 578.9250 587.7058 624.6789 699.4232 741.3500 759.5697 816.0821 867.1259 930.3816 978.9704 1011.8141 1054.0961 1082.1045 1114.1879 1123.2717 1135.5434 1150.1792 1174.3439 1216.1930 1256.6088 1265.7932 1291.9749 1328.4585 1348.5270 1409.7860 1422.0770 1433.7328 1452.8711 1465.2842 1609.5244 1673.0159 1678.8618 2996.6103 3008.8389 3011.7746 3046.7385 3073.3614 3113.0594 3154.4143 3484.7014 3522.8540 3626.0842
redmass: 5.9293 6.0236 7.7304 3.1101 1.2495 6.7576 4.1289 3.6776 4.9276 1.5845 2.7845 3.0063 4.9370 2.7324 5.0440 4.1371 1.6896 3.2931 1.9633 2.4836 2.8756 4.4936 3.1775 5.1233 4.9674 3.9913 3.8016 4.0980 2.5811 2.6100 3.2489 1.2676 1.8146 3.1258 1.4811 1.9816 1.2566 1.5011 1.5845 1.5116 1.1833 1.3606 1.6467 1.1714 1.1372 1.0496 1.0507 1.2399 10.1273 4.7112 1.0734 1.0295 1.0692 1.0864 1.1019 1.1050 1.1052 1.0447 1.0641 1.0997
irintensity: 0.1709 0.7230 1.8343 2.1085 0.0533 3.1628 4.8043 1.3777 10.2394 44.4987 22.8046 0.0088 14.8823 1.1194 5.4826 25.3894 92.6833 175.1953 43.3179 82.0331 47.1305 54.5762 5.7349 12.1911 1.8000 24.1041 2.0027 18.7188 117.4726 188.4440 46.0696 1.1189 51.2428 169.3852 1.4073 11.2076 4.1285 1.9163 9.1477 14.1725 3.0254 1.7068 4.9202 7.0551 25.4007 14.7802 11.2653 138.5992 190.7098 165.4064 10.4062 27.1616 25.3176 11.9545 19.4503 22.0846 12.7193 10.4142 30.8607 11.1000
temp: 298.150 k
press: 1.00000 atm
elementType: 9 8 8 8 8 7 6 6 6 6 6 6 1 1 1 1 1 1 1 1 1 1
symmnumber: 1
zpe: 434592.7 jmol-1
zpe.correction: 0.165528 hartree
zpe.thermalcorrener: 0.179316 hartree
zpe.thermalcorrenthalpy: 0.180260 hartree
zpe.thermalcorrgfe: 0.123915 hartree
zpe.sumelectzpe: -689.165370 hartree
zpe.sumelectthermal: -689.151581 hartree
zpe.sumelectthermalent: -689.150637 hartree
zpe.sumelectthermalfe: -689.206982 hartree
dipole: -2.5556 3.6968 1.3591
dipole: 4.6952
quadrupole: -71.7665 -70.6863 -63.8701
quadrupole: -4.9056 2.8161 5.0683
quadrupole: -2.9922 -1.9120 4.9042 -4.9056 2.8161 5.0683
hfenergy: -689.3308971 hartree
pointgroup: C01 [X(C6H10F1N1O4)]
dipole: 1.1727257 1.3966517 -0.2937933 debye
dipolederiv: -0.4286987 -0.1527767 -0.0506731 -0.1240218 -0.579144 -0.0892975 -0.0000351 -0.0509474 -0.2755354 -0.8003707 -0.3123962 -0.3085441 -0.3943974 -0.9230991 -0.2416632 -0.3158428 -0.1698733 -0.5151191 -0.5785519 0.2475483 -0.1877457 0.3485358 -0.5156879 0.329552 -0.2262589 0.2895379 -0.7233015 -0.9630039 0.0217691 -0.1787465 -0.2346799 -0.5072432 0.0777287 -0.1181176 0.1302878 -0.4374177 -0.4906347 0.2101581 -0.1365283 -0.0353901 -0.8607415 -0.0148244 -0.1659152 0.2566303 -0.4043979 -0.5174357 0.2199646 0.1699912 0.3301464 -0.5523568 -0.1439867 0.2121614 -0.2032817 -0.6983657 0.0329743 0.1401134 0.0030296 -0.0573849 -0.1214197 -0.031325 0.0276364 -0.0815229 0.0357202 0.2675524 -0.348607 -0.0150861 -0.3183608 0.2923779 0.1830772 -0.0011791 0.1528616 0.2844885 0.4292366 0.1773667 -0.0144424 0.2013342 0.5731632 0.117649 -0.1478599 0.0455569 0.2035209 1.3184433 -0.0726198 0.3573168 0.1136742 0.8227913 -0.503157 0.3530533 -0.4584115 0.6973457 0.7603349 0.0382908 0.360729 0.3762888 1.4303856 0.1899113 0.428741 -0.1588785 0.5291285 0.5007927 0.1177676 0.1428293 0.0758888 0.2469539 0.0570559 0.1894501 0.1053808 0.3791861 -0.0497425 0.0229523 -0.1169551 0.0201544 0.0799286 -0.0180876 -0.0433242 -0.0246151 -0.0312129 0.0257831 -0.075591 0.0639843 -0.0733169 -0.0530191 0.0313511 0.0686829 0.026491 0.0590252 -0.0245278 0.0156083 -0.0832452 -0.0095079 0.0373324 -0.0088144 -0.0857269 -0.0117471 -0.029652 -0.0485117 -0.0087689 0.060949 -0.0057724 0.0231709 -0.033471 0.0812 -0.0041184 -0.0587772 0.1982972 -0.0002307 -0.0849613 -0.0561791 0.1999372 -0.0354419 -0.1701731 0.0214489 0.2593396 0.139554 -0.0621322 0.0152289 -0.0665374 0.1517937 0.0956701 -0.0177871 0.2144549 0.2943254 0.2203929 -0.1141428 -0.0150056 -0.1099556 0.2127457 0.0300125 -0.05101 -0.0120106 0.3853042 0.012485 -0.0543935 0.0557974 -0.0188678 0.085243 0.0761551 -0.0070918 0.0044188 -0.0789877 0.0748486 -0.0398687 -0.0315694 -0.0858319 -0.0889584 -0.0312694 -0.0305486 -0.0012119 0.0954141 -0.0792173 0.0299884 -0.0063527 0.1241815 0.0458465 -0.0368248 0.0199452 -0.0704505 0.0299688 unknown
polarizability: 93.5376438|-0.2597112|86.5007578|7.9956219|-4.2483741|70.581869 unknown
InChI: InChI=1S/C6H10FNO4/c1-12-6(11)3(7)2-4(8)5(9)10/h3-4,9H,2,8H2,1H3
charge 0 multiplicity 1
22 atoms
F  -0.151012 -1.625015 -1.362482
O  2.196136 0.739468 0.078773
O  -1.029046 -0.938998 1.413002
O  -2.986908 -0.435189 0.257614
O  2.050922 -1.577604 0.332986
N  -2.002343 2.201759 0.053567
C  -0.333876 0.809933 -1.242785
C  -1.049078 1.093125 0.12714
C  0.623346 -0.389663 -1.324352
C  -1.81608 -0.145976 0.583371
C  1.666001 -0.524826 -0.202552
C  3.281472 0.762122 1.093747
H  -1.107466 0.669193 -2.021369
H  0.243337 1.718814 -1.495781
H  -0.272794 1.309418 0.881047
H  1.173942 -0.348549 -2.285803
H  -2.918096 1.947359 -0.326468
H  -1.627507 3.090909 -0.279914
H  -1.480521 -1.806858 1.595852
H  2.902339 0.384489 2.057615
H  3.575656 1.818054 1.166335
H  4.124577 0.133536 0.761857
