program: Gaussian 09
title: 000102790
version: EM64L-G09RevD.01
frameworkgroup: C1[X(C8H17Cl)]
method: RPBEPBE
basis: SDD
operation: Freq
keyword: #pfreq=noraman
keyword: PBEPBE/SDD
title: #p freq=noraman PBEPBE/SDD
converged: YES YES NO NO
title: Mulliken charges:
elementType: Cl C C C C C C C C H H H H H H H H H H H H H H H H H
charge: -0.090257 -0.003608 -0.020735 -0.388806 -0.391500 -0.758796 -0.758156 -0.612013 -0.708581 0.231159 0.203557 0.205985 0.225452 0.196580 0.193452 0.212755 0.212718 0.227002 0.212437 0.217949 0.214904 0.264833 0.266197 0.211744 0.217619 0.218110
chargesum: 0.00000
title: Mulliken charges with hydrogens summed into heavy atoms:
elementType: Cl C C C C C C C C
charge: -0.090257 0.227552 0.182821 0.042631 -0.001468 -0.106321 -0.112866 -0.080982 -0.061109
polarizability: 9.67740800e+01 -2.18569726e+00 9.92879642e+01 -8.35531713e-01 2.84420375e+00 8.52317512e+01
1716.lowfreq: -14.0849 -9.1284 -0.0025 0.0016 0.0022 9.4186 31.3158 40.4627 96.5509
frequency: 29.0600 40.3103 96.4720 120.7450 184.1113 189.2356 205.4348 235.1399 247.0156 288.3694 316.0128 334.2858 410.2765 440.3628 491.5827 540.7609 599.9220 687.2851 785.4185 815.2242 865.1398 889.7160 953.7842 966.6526 982.9111 999.2567 1015.8706 1040.6898 1064.0097 1093.1984 1131.0106 1148.0390 1173.8159 1185.9021 1219.9608 1250.3445 1283.5608 1288.7570 1307.6273 1323.8556 1342.7612 1352.0753 1360.0550 1385.0422 1391.1090 1393.8098 1447.5524 1456.5899 1463.2315 1476.4880 1480.3474 1481.3468 1485.2769 1487.1353 1493.4026 2945.0940 2960.5204 2966.7262 2972.3597 2977.5716 2978.9428 2993.3703 3014.8127 3026.8642 3055.5769 3061.7213 3063.1446 3068.2242 3071.7013 3075.7000 3077.9673 3132.1099
redmass: 3.1680 5.0215 2.1371 2.6947 1.5103 1.3854 1.5077 1.7163 1.3008 2.5476 2.1464 2.1046 2.6482 2.5251 2.9112 2.0890 4.4214 2.1964 1.2194 1.7920 1.5728 1.7284 1.2550 1.4574 1.9797 1.5766 1.6099 1.7909 2.2785 1.3796 2.3038 1.8679 1.9316 1.7194 1.4279 1.2100 1.2784 1.2385 1.2119 1.2943 1.4323 1.4776 1.4857 1.2197 1.2109 1.2057 1.0801 1.1011 1.0635 1.0516 1.0488 1.0519 1.0462 1.0557 1.0608 1.0820 1.0626 1.0580 1.0371 1.0374 1.0372 1.0816 1.1004 1.0955 1.0592 1.0990 1.0981 1.0988 1.0993 1.0990 1.0986 1.1107
irintensity: 0.4578 1.6205 0.3596 1.3270 0.4615 0.7636 0.6750 0.0550 0.2196 0.4203 0.6644 0.3979 0.3685 5.1497 2.1844 4.2762 21.9948 4.2368 8.0096 2.7563 9.8048 8.1276 6.9952 1.0554 4.8446 6.0621 14.4323 2.8298 2.7498 2.9210 1.5895 7.1277 1.3561 1.7559 0.6533 0.6134 4.4435 18.9453 2.2164 1.7917 0.5959 0.1908 2.0400 17.5663 31.5525 6.0599 11.5929 11.7264 7.9831 20.9110 6.4225 6.6296 5.9576 0.7768 14.9665 22.9833 14.0857 31.1964 43.5620 47.9843 11.5703 16.3202 29.1465 18.7333 21.9629 54.3257 40.8307 23.0395 62.3906 86.9421 31.3974 21.8122
temp: 298.150 k
press: 1.00000 atm
elementType: 17 6 6 6 6 6 6 6 6 1 1 1 1 1 1 1 1 1 1 1 1 1 1 1 1 1
symmnumber: 1
zpe: 611170.7 jmol-1
zpe.correction: 0.232783 hartree
zpe.thermalcorrener: 0.244801 hartree
zpe.thermalcorrenthalpy: 0.245746 hartree
zpe.thermalcorrgfe: 0.193937 hartree
zpe.sumelectzpe: -774.344592 hartree
zpe.sumelectthermal: -774.332573 hartree
zpe.sumelectthermalent: -774.331629 hartree
zpe.sumelectthermalfe: -774.383437 hartree
dipole: 1.1368 -1.9153 -0.4881
dipole: 2.2801
quadrupole: -69.7319 -65.6487 -64.7259
quadrupole: 5.2164 0.8760 0.3297
quadrupole: -3.0298 1.0535 1.9763 5.2164 0.8760 0.3297
hfenergy: -774.5773747 hartree
pointgroup: C01 [X(C8H17Cl1)]
dipole: -0.2829974 -0.8259688 0.2058768 debye
dipolederiv: -0.2773754 -0.0933941 -0.0060387 -0.1617883 -0.5573097 0.0221092 0.018597 0.0824351 -0.2125111 0.0995944 0.0483334 -0.0068566 -0.0109545 0.0370356 0.0092817 -0.03461 0.0165551 0.0790544 0.0609838 0.0017524 -0.0138624 0.0411084 0.096922 -0.0036527 -0.023296 0.0103618 0.1054013 0.0032834 -0.0096751 -0.0469413 -0.0831061 -0.0663637 -0.067814 -0.0111505 -0.0174136 0.0207779 0.0754345 0.0144224 0.0155519 0.0021504 0.0874911 0.0636069 0.0315687 0.0524081 0.110185 -0.0245863 -0.0390129 -0.0397634 -0.0055388 0.0674117 -0.0650878 -0.0318422 -0.0874856 -0.0251968 0.0424792 0.0398679 0.0241391 0.0066877 -0.0439078 0.0781288 0.0485696 0.0900628 -0.0054494 0.2119038 0.1236012 -0.0528652 0.2291055 0.7143434 -0.0915135 -0.0531629 -0.1020662 0.1888573 0.0480023 0.029931 -0.0184044 0.0164286 -0.0491072 0.0723822 -0.013276 0.0738362 0.0424754 0.073019 -0.0511752 0.0149029 -0.0104179 -0.0934053 0.0734649 0.0199463 0.0657078 -0.0152704 -0.0105503 -0.0689707 -0.0656532 -0.1026283 -0.0805443 -0.075984 -0.0703973 -0.0818126 -0.0637108 0.0618729 -0.0776209 -0.0131125 -0.0059051 -0.1392128 0.081485 -0.0735707 0.043668 0.045609 -0.0416985 0.0255395 0.0810865 0.0171175 0.0887094 -0.0131124 0.1055425 -0.0584487 -0.1009504 -0.0156258 -0.074704 -0.0716595 -0.1005976 -0.0847406 -0.0677781 -0.1124949 -0.058093 0.0058634 -0.0292107 0.0230751 0.1027547 0.0417576 0.0359077 -0.0076783 0.1455805 -0.012814 -0.1467476 0.0024123 0.0326552 0.1587479 0.0047325 0.0693012 -0.0239265 0.1129618 -0.0432586 -0.103389 0.075792 -0.0215901 -0.0096774 -0.0427075 -0.1315917 0.0525803 0.0042297 0.1226151 0.0473641 -0.1461112 0.0454709 -0.1002002 0.0608797 0.05296 0.0378315 -0.0783427 0.0224044 0.0809744 -0.1149126 0.1264716 -0.092479 0.1135301 -0.0050073 0.0438058 -0.0716959 0.0312842 0.0737728 0.0125012 -0.0974933 -0.0610657 -0.077964 -0.0336137 -0.0510655 -0.0973809 -0.109514 0.022693 0.0043742 0.0000128 0.1351805 0.033734 0.0744506 -0.0676563 0.1233695 -0.0165033 -0.1092525 -0.1286211 0.0276741 -0.0527954 0.031513 -0.0469752 0.0450117 -0.0229779 0.034544 0.0770627 0.0936287 -0.0074128 0.1156553 -0.0297736 -0.0418931 0.007988 0.082557 0.0102288 -0.0817291 -0.1427028 0.1549072 -0.0309151 0.1159648 -0.0064969 0.0334563 -0.0149189 0.0221781 0.08713 0.0042777 -0.1321903 -0.0719806 -0.0790787 -0.0120053 -0.0435322 -0.0795312 -0.0777837 0.0127889 0.0618352 -0.0204754 0.1062517 -0.0042493 0.0676421 -0.0423308 0.0957253 -0.0130961 -0.1358026 unknown
polarizability: 95.9826977|1.5637549|99.9104162|0.0895131|-3.3129264|85.4006816 unknown
InChI: InChI=1S/C8H17Cl/c1-4-7(2)8(3)5-6-9/h7-8H,4-6H2,1-3H3
charge 0 multiplicity 1
26 atoms
Cl 2.611823 1.699533 0.051654
C  0.08547 -0.364489 -0.642762
C  -0.790403 -0.118453 0.630131
C  1.509956 -0.894318 -0.31777
C  -2.148902 0.567157 0.304466
C  -0.580479 -1.305868 -1.676416
C  -1.036182 -1.401131 1.463622
C  2.333259 -0.076997 0.676602
C  -2.030476 1.923558 -0.425585
H  0.226466 0.622418 -1.127241
H  -0.231543 0.600658 1.267636
H  1.439922 -1.922372 0.10018
H  2.079429 -0.984894 -1.263444
H  -2.781915 -0.123048 -0.289401
H  -2.686009 0.722017 1.262689
H  0.050112 -1.395953 -2.580815
H  -0.72441 -2.324457 -1.269337
H  -1.567212 -0.928139 -1.997666
H  -0.093946 -1.895003 1.764837
H  -1.637115 -2.138217 0.899104
H  -1.594068 -1.159904 2.387798
H  3.348082 -0.482112 0.807841
H  1.843664 0.046788 1.653939
H  -3.017814 2.41436 -0.506732
H  -1.354161 2.609185 0.119025
H  -1.633052 1.808982 -1.450555
