program: Gaussian 09
title: 000102789
version: EM64L-G09RevD.01
frameworkgroup: C1[X(C8H17Cl)]
method: RPBEPBE
basis: SDD
operation: Freq
keyword: #pfreq=noraman
keyword: PBEPBE/SDD
title: #p freq=noraman PBEPBE/SDD
converged: YES YES NO NO
title: Mulliken charges:
elementType: Cl C C C C C C C C H H H H H H H H H H H H H H H H H
charge: -0.092426 0.017795 -0.387400 -0.366606 -0.371693 -0.751641 -0.355667 -0.616334 -0.696452 0.214782 0.188464 0.185412 0.191973 0.195192 0.243201 0.197193 0.218714 0.203761 0.224874 0.194456 0.194722 0.265180 0.266607 0.211430 0.215680 0.208782
chargesum: 0.00000
title: Mulliken charges with hydrogens summed into heavy atoms:
elementType: Cl C C C C C C C C
charge: -0.092426 0.232578 -0.013524 0.020559 0.068700 -0.104292 0.033511 -0.084547 -0.060559
polarizability: 1.07639174e+02 -2.05839732e-02 9.11443494e+01 -2.03220479e+00 3.89571255e+00 8.59442104e+01
1716.lowfreq: -9.6766 -0.0034 -0.0030 -0.0020 7.0171 14.7992 25.6375 60.8354 73.7227
frequency: 23.4163 60.1270 73.4465 98.6351 116.0469 151.6079 188.3585 233.2081 244.5440 259.1623 303.8144 355.0630 394.0069 465.5849 511.8760 597.5180 725.1305 751.1255 784.8391 864.1806 892.0116 901.7162 919.2645 950.0178 997.3823 1032.2262 1049.6857 1060.7815 1082.9792 1099.5662 1132.7904 1160.3884 1173.7505 1199.6988 1238.7740 1256.9198 1276.3115 1291.4112 1293.2722 1305.3549 1322.2810 1344.2292 1353.9229 1365.3685 1383.1479 1393.2524 1440.3584 1453.5215 1459.8886 1466.8142 1472.1510 1477.9019 1479.2091 1487.7198 1489.0039 2942.4012 2947.6123 2958.7937 2967.6757 2968.0535 2972.5158 2978.0213 2993.8342 3008.0268 3034.7989 3041.4407 3056.4761 3062.3836 3068.8138 3071.2038 3071.9216 3133.4394
redmass: 4.9371 1.6158 2.8138 3.7893 2.6860 1.9769 1.3540 1.2034 2.3049 1.8769 2.4312 3.4419 1.9347 2.4752 2.7266 4.7080 1.1295 1.8662 1.2531 1.4992 1.7232 1.5814 1.3244 1.8595 1.4444 2.6098 1.7112 1.7787 2.1471 1.6437 2.0219 2.1549 1.4895 1.5396 1.3820 1.2650 1.2205 1.1514 1.1263 1.2378 1.2958 1.4962 1.5428 1.5052 1.2244 1.2182 1.0831 1.0941 1.0758 1.0700 1.0609 1.0670 1.0444 1.0812 1.0526 1.0667 1.0605 1.0589 1.0396 1.0607 1.0363 1.0791 1.0966 1.1011 1.1034 1.0900 1.0605 1.0981 1.1006 1.0993 1.0986 1.1106
irintensity: 1.4705 0.0933 0.2821 1.5356 0.5484 0.0597 0.8917 0.0237 0.3754 0.8753 0.1735 2.7591 0.3538 0.5078 4.7658 22.5023 7.9806 3.1324 6.5844 11.9657 4.3828 7.7072 2.4603 3.4556 10.6692 2.0634 2.5109 4.1475 3.8631 6.2636 0.2697 1.3764 5.4365 0.4085 0.5261 2.2185 5.4350 19.5427 3.0930 0.2285 1.6037 3.1982 5.3524 0.9160 20.0649 9.5116 6.1087 11.7918 0.5563 0.3366 5.9141 3.7695 12.5283 15.5167 16.7185 17.2235 15.7350 1.0714 22.3927 83.8122 33.7881 32.5349 5.8961 3.7117 59.0610 24.3605 33.7493 46.0588 92.9640 57.1903 47.4484 18.9206
temp: 298.150 k
press: 1.00000 atm
elementType: 17 6 6 6 6 6 6 6 6 1 1 1 1 1 1 1 1 1 1 1 1 1 1 1 1 1
symmnumber: 1
zpe: 611185.1 jmol-1
zpe.correction: 0.232788 hartree
zpe.thermalcorrener: 0.244947 hartree
zpe.thermalcorrenthalpy: 0.245891 hartree
zpe.thermalcorrgfe: 0.192956 hartree
zpe.sumelectzpe: -774.346863 hartree
zpe.sumelectthermal: -774.334704 hartree
zpe.sumelectthermalent: -774.333760 hartree
zpe.sumelectthermalfe: -774.386695 hartree
dipole: -1.1181 1.4019 1.6377
dipole: 2.4285
quadrupole: -70.2572 -67.7495 -63.3181
quadrupole: 3.8098 4.6840 -0.8598
quadrupole: -3.1489 -0.6412 3.7901 3.8098 4.6840 -0.8598
hfenergy: -774.5796511 hartree
pointgroup: C01 [X(C8H17Cl1)]
dipole: -0.3748191 0.4650649 0.7456988 debye
dipolederiv: -0.3047836 0.0763192 0.0824032 0.1146514 -0.2983315 -0.1362069 0.1755597 -0.168707 -0.4531333 0.0632624 0.0158817 0.0014353 -0.0510476 0.122981 0.0106729 0.0069634 -0.0155357 0.0925518 -0.0068095 -0.0520794 0.0044156 -0.0055091 0.0583959 0.0142701 -0.0106032 0.0140087 0.1827853 -0.0750718 -0.0457359 0.0083527 -0.0170838 0.0506789 -0.0173806 0.0308229 -0.0096062 0.1670845 -0.0868361 0.031202 0.0090653 0.0689831 -0.0090953 0.0146725 0.120369 -0.0378375 0.0011849 -0.0530567 -0.0721871 -0.0082074 -0.0279474 -0.0445359 0.0342595 -0.0024547 0.0600004 0.0918612 0.0748472 -0.0216979 0.0000929 -0.0627974 0.0852112 -0.0058223 -0.0208331 -0.0101068 0.1759854 0.2819396 -0.0978469 -0.1689637 -0.1033367 0.3214105 0.2111076 -0.2471667 0.2732438 0.5643135 -0.0494081 -0.0759791 -0.0054663 -0.0434107 0.0184285 -0.009026 -0.002694 -0.0084392 0.0929304 0.0591186 -0.0268238 0.0005935 -0.0007421 -0.0071292 -0.0856648 -0.0093404 -0.0579092 -0.1023804 0.0023774 0.0723676 -0.042319 0.0610867 -0.0853581 0.101139 -0.0621002 0.1307572 -0.0329368 0.0311848 -0.0049301 0.0026335 -0.0145859 0.0109813 -0.080089 0.0391573 -0.1184342 -0.1439356 0.032985 0.0239183 0.0456245 0.0150381 -0.0012357 -0.09132 0.0429992 -0.1142484 -0.1118798 0.0471054 0.0330497 -0.0339309 0.0464818 -0.0789711 0.1078041 -0.0540476 0.1271301 -0.0557134 0.0229012 -0.0933032 0.0143985 -0.1155431 -0.0946783 0.0301309 -0.0163503 0.0220918 0.0804382 0.0222957 0.0649077 0.0709926 0.0247433 0.0450938 -0.1236897 -0.003882 -0.0497348 -0.1172095 0.0548287 0.1016648 -0.0840655 0.0563364 -0.0543807 0.0961107 -0.0640954 0.1225051 -0.0110527 0.0835604 -0.0031163 0.0251813 -0.0270248 0.0350555 -0.0490819 -0.0139168 -0.1284026 -0.1390108 -0.2022854 -0.0118163 0.0597045 0.0168738 0.0837305 -0.0255965 0.0593901 -0.0230868 0.0720348 0.0277516 -0.0045801 0.0116891 0.0187747 -0.0161246 -0.1140695 0.0505824 -0.1336034 -0.1231038 0.0172488 0.0029621 -0.0155549 0.0373808 -0.0786825 0.1246268 -0.0466016 0.1437635 -0.0564667 0.0274694 0.0691243 -0.0137752 0.1061482 -0.0361292 0.0511845 -0.0314095 0.0394041 -0.0945621 -0.0066398 -0.070171 0.0262999 -0.1242565 -0.0407921 -0.0693444 0.0575477 -0.0680207 -0.0029503 0.0867173 0.0247047 0.0605323 -0.0186846 0.0071867 -0.0961283 0.0141988 -0.1261845 -0.1158569 -0.2349643 0.0210148 0.007554 0.0557041 0.0574722 -0.0053389 0.0114289 -0.0055192 0.098743 0.0842617 0.0431502 -0.0586858 -0.0102329 -0.0511817 0.1127803 -0.0235239 0.1424715 -0.0597208 unknown
polarizability: 107.404503|-0.7541405|89.7432871|-2.5662323|4.7098453|87.5799437 unknown
InChI: InChI=1S/C8H17Cl/c1-3-4-5-8(2)6-7-9/h8H,3-7H2,1-2H3
charge 0 multiplicity 1
26 atoms
Cl 3.145509 -1.538946 -0.983139
C  0.777703 0.684273 -0.189089
C  -0.726523 0.975084 0.071784
C  -1.670445 -0.241552 -0.072278
C  1.333361 -0.334775 0.840782
C  1.585801 2.00382 -0.188838
C  -3.164844 0.149773 0.000169
C  2.80852 -0.704297 0.694136
C  -4.112429 -1.062216 -0.128503
H  0.867598 0.222927 -1.19455
H  -1.05458 1.757421 -0.644099
H  -0.84303 1.416519 1.085189
H  -1.471709 -0.747367 -1.04043
H  -1.461792 -0.990032 0.718729
H  0.733462 -1.263067 0.812483
H  1.213582 0.091524 1.862703
H  1.143636 2.729145 -0.896601
H  1.583566 2.470949 0.815742
H  2.636179 1.849105 -0.494763
H  -3.358425 0.673021 0.959188
H  -3.387591 0.882265 -0.802591
H  3.12654 -1.450289 1.438269
H  3.482755 0.164343 0.713026
H  -3.957811 -1.585233 -1.091189
H  -5.173305 -0.755196 -0.077269
H  -3.933027 -1.794197 0.681739
