program: Gaussian 09
title: 000102776
version: EM64L-G09RevD.01
frameworkgroup: C1[X(C6H10O)]
method: RPBEPBE
basis: SDD
operation: Freq
keyword: #pfreq=noraman
keyword: PBEPBE/SDD
title: #p freq=noraman PBEPBE/SDD
converged: NO YES NO NO
title: Mulliken charges:
elementType: O C C C C C C H H H H H H H H H H
charge: -0.236009 -0.057145 -0.433153 -0.317668 -0.252081 -0.708789 -0.138979 0.209295 0.220676 0.206487 0.203656 0.220404 0.211690 0.209911 0.214623 0.219563 0.227519
chargesum: 0.00000
title: Mulliken charges with hydrogens summed into heavy atoms:
elementType: O C C C C C C
charge: -0.236009 0.152150 -0.005990 0.106393 -0.040391 -0.064693 0.088540
polarizability: 7.72931712e+01 -1.65186887e+00 6.60129524e+01 -3.26662867e+00 -8.93152691e-01 4.84916731e+01
1716.lowfreq: -11.8259 -0.0008 -0.0008 -0.0008 10.1403 21.0892 117.3789 229.4533 251.2294
frequency: 117.3275 229.4416 251.2198 298.5970 344.9507 430.9737 503.3727 555.0521 727.6331 736.9392 791.7222 812.8728 899.3828 910.5650 953.9083 981.7291 998.8847 1048.8299 1069.8807 1114.4592 1150.2662 1209.4066 1229.4859 1237.0343 1294.0931 1303.8609 1336.5550 1348.1036 1375.8013 1390.1077 1452.0269 1466.8465 1473.8190 1477.8046 1642.0214 2937.0527 2971.0171 2978.2207 2989.6253 3051.9155 3067.9127 3073.2856 3087.2496 3130.4947 3176.9171
redmass: 3.3328 1.1831 1.5371 2.4564 2.2539 5.0610 3.1054 2.8748 1.8184 1.7547 2.8690 2.7403 2.0864 1.2764 1.3432 2.2026 1.6284 3.0739 2.1980 2.2481 1.4738 1.6733 1.3283 1.2121 1.2920 1.3459 1.4875 1.3364 1.3801 1.2418 1.0902 1.0917 1.0477 1.0557 6.8520 1.0825 1.0352 1.0674 1.0594 1.1020 1.0996 1.1000 1.0994 1.0867 1.0996
irintensity: 2.1325 0.5270 1.8969 3.2007 10.5838 2.4835 3.6481 3.9448 33.3134 15.4964 5.1072 21.0101 6.6100 0.5914 5.0056 9.0564 20.1439 32.7329 9.2844 6.0110 21.9945 21.6002 57.5785 0.1155 0.9985 5.1690 0.5656 3.7325 4.8980 9.2951 7.5555 7.2983 11.3545 7.3018 69.4394 27.1142 39.8148 51.8160 33.4511 36.4313 39.3979 49.8021 38.7326 6.3228 25.6594
temp: 298.150 k
press: 1.00000 atm
elementType: 8 6 6 6 6 6 6 1 1 1 1 1 1 1 1 1 1
symmnumber: 1
zpe: 386565.3 jmol-1
zpe.correction: 0.147235 hartree
zpe.thermalcorrener: 0.154061 hartree
zpe.thermalcorrenthalpy: 0.155005 hartree
zpe.thermalcorrgfe: 0.116777 hartree
zpe.sumelectzpe: -309.271762 hartree
zpe.sumelectthermal: -309.264936 hartree
zpe.sumelectthermalent: -309.263992 hartree
zpe.sumelectthermalfe: -309.302220 hartree
dipole: -1.4500 -0.9704 0.5485
dipole: 1.8290
quadrupole: -46.6492 -38.9240 -44.2598
quadrupole: -0.8810 0.3722 -0.6602
quadrupole: -3.3716 4.3537 -0.9821 -0.8810 0.3722 -0.6602
hfenergy: -309.418997 hartree
pointgroup: C01 [X(C6H10O1)]
dipole: 0.5822388 0.3643742 0.2145139 debye
dipolederiv: -0.6737307 0.1286233 -0.0234173 0.4986689 -0.9701115 0.0073691 -0.0700388 -0.0123602 -0.3051329 0.086535 0.012451 0.0106724 0.0731131 0.0410022 0.0153433 0.0053569 0.0207723 0.2397912 -0.1287179 -0.008351 0.0233838 0.0316216 0.0113584 0.0275511 0.0646351 0.0067197 0.0839642 0.1872033 0.1671348 -0.0013233 -0.0656198 0.6023975 0.0527042 -0.0516719 0.0922803 0.392571 -0.331107 0.142413 0.0343865 0.027098 -0.0030504 0.0170309 0.0303803 0.0929853 -0.3478673 -0.0114872 0.0172282 0.0560736 -0.0252432 0.0651577 -0.0072383 0.0199101 -0.0054707 0.0750674 0.6655184 -0.3943518 0.108781 -0.5020053 0.644947 -0.0145145 0.140507 -0.0621297 -0.060702 0.0011529 -0.0103907 -0.0225766 -0.0670044 0.0213184 -0.053863 -0.0503904 -0.0433251 -0.1842296 0.044198 0.0123508 0.0230445 0.0200583 0.0775666 -0.0273804 0.0255358 0.0330728 -0.1513761 0.0430955 -0.1189276 -0.028393 -0.0748664 -0.1409059 -0.0451211 -0.0268126 -0.0693903 0.0736548 0.0689498 -0.0617305 -0.0043686 -0.002075 0.0027387 0.0230357 0.0716835 -0.0843408 -0.1870683 -0.0326087 0.0982616 -0.0385725 0.0984974 -0.0854538 0.0245972 -0.0630824 0.0660911 0.0595886 0.0380515 0.1011853 -0.0206408 0.0455116 -0.105739 0.0073952 -0.0174188 -0.0014972 0.1662716 -0.0402586 -0.0968095 0.0010239 -0.1661669 -0.1076117 -0.0293971 -0.0111882 -0.0375944 0.0815083 -0.0131569 0.0933966 -0.0262359 0.1518714 -0.0650026 0.0737051 -0.0568945 0.0816161 0.0452591 0.0760748 -0.0082914 -0.058296 0.011075 0.0868932 -0.0353943 0.0205666 -0.0342982 -0.1544629 0.0202878 -0.0741921 -0.0335416 -0.0545341 -0.0755045 -0.0358231 -0.0310778 -0.0431311 0.173163 unknown
polarizability: 77.2974824|-1.9557541|66.0578329|2.8408323|1.1786409|48.4424814 unknown
InChI: InChI=1S/C6H10O/c1-6-2-4-7-5-3-6/h2,4,6H,3,5H2,1H3
charge 0 multiplicity 1
17 atoms
O  -1.862764 -0.069226 -0.221348
C  1.073616 0.076369 0.390831
C  0.256496 1.266431 -0.179491
C  -1.214275 1.176343 0.260541
C  0.275025 -1.205978 0.191796
C  2.46904 -0.020987 -0.272283
C  -1.049043 -1.210577 -0.122203
H  1.230315 0.246388 1.478943
H  0.305234 1.244253 -1.285575
H  0.680732 2.232941 0.154277
H  -1.289503 1.189047 1.367342
H  -1.829346 1.990096 -0.15671
H  0.795324 -2.168888 0.255106
H  3.042894 0.914106 -0.128936
H  3.05755 -0.851424 0.160417
H  2.370423 -0.204443 -1.358422
H  -1.629417 -2.111453 -0.341486
