program: Gaussian 09
title: 000102765
version: EM64L-G09RevD.01
frameworkgroup: C1[X(C12H16O2)]
method: RPBEPBE
basis: SDD
operation: Freq
keyword: #pfreq=noraman
keyword: PBEPBE/SDD
title: #p freq=noraman PBEPBE/SDD
converged: YES YES NO NO
title: Mulliken charges:
elementType: O O C C C C C C C C C C C C H H H H H H H H H H H H H H H H
charge: -0.298453 -0.270109 -0.053328 -0.350315 -0.311318 -0.235720 0.557855 0.341580 -0.473681 -0.377490 -0.692433 -0.692727 -0.344454 -0.393874 0.249692 0.227454 0.222483 0.214951 0.223214 0.207607 0.230871 0.230570 0.226977 0.211279 0.209611 0.211235 0.227271 0.209414 0.245965 0.245871
chargesum: 0.00000
title: Mulliken charges with hydrogens summed into heavy atoms:
elementType: O O C C C C C C C C C C C C
charge: -0.298453 -0.270109 0.196364 0.099623 0.126846 -0.028113 0.557855 0.341580 -0.242810 -0.146920 -0.044567 -0.044806 -0.098489 -0.148003
polarizability: 1.97161954e+02 5.09248830e-01 1.20858400e+02 1.10685430e+00 -1.05116116e+00 9.20143644e+01
1716.lowfreq: -14.6965 -8.1399 0.0005 0.0006 0.0008 4.2739 24.1549 45.1447 50.3935
frequency: 23.2335 44.9573 50.3795 85.4983 96.8232 118.6889 181.2694 206.1678 215.1080 230.3967 247.3226 305.7167 321.4751 401.1430 405.8780 420.0949 458.4886 468.3018 543.0017 554.4524 633.4581 687.4332 736.0727 749.4467 796.3685 812.2990 813.5869 835.2759 889.4012 898.7107 915.5466 937.0381 953.1423 960.8015 967.1195 986.2555 1002.6187 1028.8786 1051.1134 1097.9938 1112.4839 1113.3166 1114.2191 1138.8485 1153.8728 1179.1362 1209.5158 1217.6273 1225.6363 1238.6850 1289.8151 1308.8367 1326.8781 1348.2901 1376.6682 1387.7211 1395.6740 1414.1102 1419.9221 1465.5640 1467.4579 1473.8806 1478.2293 1482.4683 1486.0771 1501.5556 1585.2931 1621.6387 2961.9873 2973.0997 2975.8035 2978.2134 3023.9517 3065.5318 3071.5666 3072.3492 3076.5958 3080.9861 3115.5142 3119.1620 3123.5347 3156.5514 3162.0224 3181.3075
redmass: 4.3979 3.0671 3.5822 4.7211 3.1584 3.6698 2.8806 1.1960 3.6826 3.1183 1.1248 3.3463 3.6472 2.3726 3.4850 3.2944 3.0087 4.4248 2.3010 3.3061 6.8811 4.0446 3.4396 6.7607 4.4302 5.1771 1.3460 1.5815 2.5542 1.1959 1.1861 1.3793 1.4756 1.3673 2.3427 3.1079 2.8206 1.4289 1.5366 1.3660 1.3458 2.5222 1.4199 1.5219 1.7515 1.2844 1.3963 1.8365 2.8676 1.4638 1.5222 1.3215 1.7244 1.3772 1.1969 3.1188 1.2563 2.1877 2.5356 1.0451 1.0511 1.2046 1.0495 1.1978 1.1191 2.0708 6.8750 6.5211 1.0556 1.0348 1.0364 1.0830 1.1068 1.0999 1.0532 1.0991 1.1004 1.0996 1.0919 1.0889 1.0886 1.0940 1.0953 1.1191
irintensity: 0.0525 0.0510 3.7970 2.4457 0.7228 4.3178 1.4919 0.5757 4.8321 1.3934 0.3224 9.5078 2.9224 0.8620 0.0488 0.1464 0.6973 7.7615 26.2843 2.0581 0.6502 6.7392 2.3089 8.1355 27.4028 16.0980 17.1898 54.8611 1.7626 6.2240 2.9440 0.0988 0.0854 0.5480 23.1175 85.1255 12.4042 0.5644 18.0652 4.0962 8.1141 1.4673 19.3049 1.7905 2.2152 91.0710 41.6092 68.0247 123.3926 8.6258 12.0708 0.9785 1.2229 11.0965 16.1266 23.1519 5.8053 6.0736 1.4007 3.0798 2.8730 21.9477 15.7145 10.9212 13.8765 130.9284 10.5555 41.4746 33.9302 32.6338 38.8792 18.0165 29.8543 0.5953 25.4534 105.2406 25.6400 42.0155 16.3972 18.2898 21.7008 17.5017 4.6966 30.5357
temp: 298.150 k
press: 1.00000 atm
elementType: 8 8 6 6 6 6 6 6 6 6 6 6 6 6 1 1 1 1 1 1 1 1 1 1 1 1 1 1 1 1
symmnumber: 1
zpe: 656765.1 jmol-1
zpe.correction: 0.250149 hartree
zpe.thermalcorrener: 0.264603 hartree
zpe.thermalcorrenthalpy: 0.265547 hartree
zpe.thermalcorrgfe: 0.207287 hartree
zpe.sumelectzpe: -616.198434 hartree
zpe.sumelectthermal: -616.183980 hartree
zpe.sumelectthermalent: -616.183035 hartree
zpe.sumelectthermalfe: -616.241295 hartree
dipole: -1.4060 0.4761 0.5092
dipole: 1.5694
quadrupole: -87.5347 -80.7310 -85.0965
quadrupole: 8.2463 2.2702 -0.2924
quadrupole: -3.0807 3.7231 -0.6424 8.2463 2.2702 -0.2924
hfenergy: -616.4485823 hartree
pointgroup: C01 [X(C12H16O2)]
dipole: -0.5539355 -0.2167016 -0.1655992 debye
polarizability: 197.1400115|-0.4593674|119.9163041|-1.9132307|-5.2240144|92.9784035 unknown
InChI: InChI=1S/C12H16O2/c1-9(2)10-3-5-11(6-4-10)13-7-12-8-14-12/h3-6,9,12H,7-8H2,1-2H3
charge 0 multiplicity 1
30 atoms
O  5.26915 0.730925 -0.035995
O  1.782889 -0.581675 0.434366
C  4.124035 -0.109543 0.478466
C  4.950445 -0.610564 -0.662462
C  2.760035 0.500763 0.243868
C  -3.895532 0.43481 -0.066078
C  -2.388832 0.193861 0.060584
C  0.419811 -0.24979 0.29596
C  -1.461021 1.239862 -0.149923
C  -1.871937 -1.089101 0.393969
C  -4.516793 -0.41099 -1.210034
C  -4.632922 0.171219 1.274294
C  -0.064526 1.03686 -0.036982
C  -0.48922 -1.314812 0.512468
H  4.288976 -0.535023 1.476106
H  5.699359 -1.390672 -0.483681
H  4.543745 -0.556629 -1.679961
H  2.696524 0.914171 -0.78305
H  2.570662 1.318081 0.969735
H  -4.041451 1.503722 -0.32353
H  -1.831222 2.239903 -0.408452
H  -2.559938 -1.925736 0.56534
H  -4.018203 -0.205759 -2.174368
H  -5.594376 -0.186921 -1.320109
H  -4.417168 -1.492809 -1.001982
H  -5.711788 0.394817 1.176599
H  -4.220121 0.795839 2.086738
H  -4.534817 -0.887503 1.579504
H  0.616974 1.875298 -0.210444
H  -0.090438 -2.301203 0.769655
