program: Gaussian 09
title: 000102754
version: EM64L-G09RevD.01
frameworkgroup: C1[X(C9H11Br)]
method: RPBEPBE
basis: SDD
operation: Freq
keyword: #pfreq=noraman
keyword: PBEPBE/SDD
title: #p freq=noraman PBEPBE/SDD
converged: YES YES NO NO
title: Mulliken charges:
elementType: Br C C C C C C C C C H H H H H H H H H H H
charge: -0.064818 -0.515432 -0.419027 0.470228 -0.642555 -0.385321 -0.406392 -0.225930 -0.225703 -0.238280 0.233326 0.244642 0.296520 0.242694 0.234023 0.244291 0.234993 0.236540 0.227665 0.227702 0.230835
chargesum: 0.00000
title: Mulliken charges with hydrogens summed into heavy atoms:
elementType: Br C C C C C C C C C
charge: -0.064818 -0.037464 -0.122507 0.470228 0.078453 -0.150329 -0.169852 0.001734 0.001999 -0.007444
polarizability: 1.65024207e+02 -7.14556695e+00 9.66963727e+01 -1.37538552e+01 -8.66949109e+00 6.88342567e+01
1716.lowfreq: -5.8730 0.0001 0.0004 0.0004 2.7899 21.5692 43.3949 55.3605 81.1554
frequency: 43.2720 55.2974 81.1445 173.4382 233.8688 250.4533 281.9896 334.1895 394.9164 403.7174 488.3348 512.0117 615.5289 618.2695 706.4162 755.5980 809.7690 855.1114 866.1171 903.7516 923.7426 978.0267 989.9193 995.4954 999.1356 1026.5074 1045.6071 1092.9257 1128.9542 1166.6009 1173.3600 1187.8391 1207.2101 1226.9657 1296.9423 1321.4798 1339.7594 1382.3570 1392.6083 1440.1654 1462.9549 1466.3410 1477.0551 1483.1523 1592.6807 1611.8690 2984.5695 3007.5270 3057.3079 3073.6862 3082.0621 3107.1100 3115.0134 3119.6781 3134.1283 3145.9661 3164.2449
redmass: 3.9041 3.6045 4.5346 8.7343 2.0248 1.5259 2.7100 2.7896 2.0130 2.8154 3.0787 5.0057 4.4968 4.8271 1.7569 1.9888 3.5243 1.2566 2.3232 1.4552 1.4457 1.3886 6.2462 1.3416 1.3571 2.2152 1.6025 1.5540 2.3481 1.2163 1.0534 1.1150 2.7417 1.3304 1.3698 1.3403 1.3186 7.6122 1.2163 2.1461 1.0489 1.0919 1.1697 1.8792 6.0477 6.1207 1.0370 1.0598 1.0921 1.0999 1.0957 1.1001 1.0878 1.0869 1.0907 1.0958 1.1015
irintensity: 0.6658 0.1234 0.0810 2.6894 1.0689 2.6312 4.2277 0.6324 1.0656 0.0177 14.5221 30.3704 13.4670 9.1222 53.9260 44.5270 4.8791 0.0148 6.5815 4.1676 2.9039 0.0573 0.3933 8.7056 12.1022 5.7417 17.2873 18.6862 13.3966 49.7952 0.7919 0.1434 0.4949 3.3200 19.5591 0.7830 2.7590 0.0423 22.0371 8.9235 6.5477 7.2176 20.0137 8.3418 1.4027 4.7318 13.5418 14.8301 1.5641 4.2777 29.9256 21.5737 9.1264 6.4725 8.4358 40.2304 23.6472
temp: 298.150 k
press: 1.00000 atm
elementType: 35 6 6 6 6 6 6 6 6 6 1 1 1 1 1 1 1 1 1 1 1
symmnumber: 1
zpe: 453289.8 jmol-1
zpe.correction: 0.172649 hartree
zpe.thermalcorrener: 0.182656 hartree
zpe.thermalcorrenthalpy: 0.183600 hartree
zpe.thermalcorrgfe: 0.135225 hartree
zpe.sumelectzpe: -362.280086 hartree
zpe.sumelectthermal: -362.270079 hartree
zpe.sumelectthermalent: -362.269135 hartree
zpe.sumelectthermalfe: -362.317510 hartree
dipole: -2.8161 0.5444 0.6264
dipole: 2.9358
quadrupole: -72.7150 -65.0979 -71.1399
quadrupole: 0.2977 -1.4203 -2.4469
quadrupole: -3.0641 4.5530 -1.4889 0.2977 -1.4203 -2.4469
hfenergy: -362.4527349 hartree
pointgroup: C01 [X(C9H11Br1)]
dipole: -1.0743784 -0.334962 -0.2600312 debye
dipolederiv: -0.80459 -0.1812306 -0.0750315 -0.1582343 -0.2437137 -0.0491086 -0.1032618 -0.0682782 -0.216334 -0.2200204 -0.0366372 0.0508188 -0.0764573 0.0697141 -0.0430421 -0.0523376 -0.0622305 0.0638324 1.1625759 0.2728727 0.1349719 0.2489624 0.284596 0.1110142 0.071615 0.129838 0.2110796 0.2664356 0.0135038 0.0436745 0.0610521 -0.0240957 -0.0001002 0.2140591 0.0075551 -0.0657278 -0.1725879 -0.1203454 -0.0503452 0.0229003 -0.1068106 -0.0910828 0.0385409 -0.1235521 -0.0096585 -0.1453359 0.0670388 0.0077487 0.0623354 0.0299027 -0.0516581 0.0043549 -0.056081 -0.1345496 -0.1496139 -0.0485179 0.0546938 -0.0256887 0.0054567 -0.0874764 0.0512303 -0.082516 -0.1047536 -0.0040246 -0.0432127 0.0624657 -0.0661779 0.0454999 -0.096351 0.0619484 -0.0939452 -0.08001 -0.0252558 0.0772135 0.0121891 0.097244 0.0709487 -0.0666211 -0.0121515 -0.0728271 -0.1054606 0.0547665 0.0301142 0.0750759 0.0148685 -0.0950378 -0.0202282 0.0723074 -0.0213783 -0.1338118 0.0279967 0.0121942 -0.0327795 0.041517 -0.0083562 0.1223219 -0.0247969 0.0670658 -0.013858 0.0202695 -0.0004775 -0.0217341 -0.025528 -0.0776491 -0.089181 -0.0110515 -0.0437772 0.0453132 -0.0727913 0.0208586 -0.0774382 -0.0047398 -0.0399162 0.0420283 -0.037865 0.0354979 -0.0324184 -0.0723684 -0.057042 -0.0761026 -0.1216825 0.0281896 -0.0342666 -0.1111577 -0.010378 0.0857751 0.1020408 0.0389832 -0.0213142 0.0204622 0.000053 0.0620654 -0.055487 0.1232572 -0.0286917 0.0100323 0.0450148 0.1233959 0.0097717 0.0837236 -0.0101123 0.1227013 -0.0326198 -0.0378524 0.0420494 -0.1104073 0.0038483 -0.0993324 -0.0391154 0.0468084 0.0006719 0.0415657 0.1204268 0.0429462 0.0802948 -0.0788741 0.0664841 -0.0039654 0.078403 -0.070489 0.0862319 0.0855156 0.027003 0.0625725 -0.0640034 0.0777459 -0.0206379 0.0975235 -0.078816 0.0950933 0.0929573 0.0246048 -0.0918251 0.0033053 -0.1142208 -0.0551137 0.0611493 -0.0026186 0.0626471 0.1291764 -0.1141322 -0.0309654 -0.074565 -0.031282 0.0963275 0.0179145 -0.0773967 0.0188313 0.12905 unknown
polarizability: 162.0625058|14.7373257|97.7116826|16.5482323|-8.6114292|70.7806481 unknown
InChI: InChI=1S/C9H11Br/c1-8(10)7-9-5-3-2-4-6-9/h2-6,8H,7H2,1H3
charge 0 multiplicity 1
21 atoms
Br 4.069968 0.65919 0.197472
C  1.220325 0.343472 0.847109
C  2.152169 0.133052 -0.369861
C  -0.245038 0.175043 0.453469
C  2.189161 -1.291887 -0.924338
C  -0.927177 1.21711 -0.228183
C  -0.948265 -1.023811 0.736343
C  -2.275817 1.064699 -0.620012
C  -2.298613 -1.179971 0.347771
C  -2.966138 -0.136562 -0.334187
H  1.499789 -0.376652 1.637654
H  1.392102 1.357749 1.250507
H  1.936912 0.871499 -1.160261
H  1.174628 -1.578225 -1.261613
H  2.514691 -2.009594 -0.151166
H  2.876551 -1.368834 -1.782854
H  -0.401683 2.156683 -0.442175
H  -0.437574 -1.834925 1.269882
H  -2.789016 1.880842 -1.141004
H  -2.828796 -2.110716 0.579165
H  -4.013077 -0.255561 -0.634617
