program: Gaussian 09
title: 000102751
version: EM64L-G09RevD.01
frameworkgroup: C1[X(C12H17NO)]
method: RPBEPBE
basis: SDD
operation: Freq
keyword: #p
keyword: freq=noraman
keyword: PBEPBE/SDD
title: #p freq=noraman PBEPBE/SDD
converged: YES YES NO NO
title: Mulliken charges:
elementType: O N C C C C C C C C C C C C H H H H H H H H H H H H H H H H H
charge: -0.442635 -0.069021 0.195069 -0.509003 -0.454380 -0.404171 0.450685 -0.748162 -0.637484 -0.524088 -0.425014 0.290409 -0.211787 -0.417675 0.237470 0.221055 0.196346 0.227323 0.225094 0.184061 0.218070 0.214835 0.250321 0.227019 0.186237 0.223276 0.262547 0.239661 0.221664 0.219410 0.352869
chargesum: 0.00000
title: Mulliken charges with hydrogens summed into heavy atoms:
elementType: O N C C C C C C C C C C C C
charge: -0.089766 -0.069021 0.195069 -0.050478 -0.030712 0.004984 0.450685 -0.064936 -0.000952 -0.261541 -0.185353 0.290409 0.009876 -0.198265
polarizability: 1.76921374e+02 -2.84115783e+00 1.38086217e+02 5.49066692e+00 4.95918914e+00 9.29972084e+01
1716.lowfreq: -14.5665 -2.8162 -0.0004 -0.0004 -0.0003 8.7231 34.7861 63.3492 94.8251
frequency: 34.6568 63.3024 94.7974 117.1776 154.3858 223.2139 238.1583 256.2761 268.6213 282.2456 290.4422 308.3107 332.5003 351.3892 396.8432 404.0892 463.4954 471.8699 521.3912 581.2630 616.5306 645.9115 703.6425 741.2036 777.6284 789.6705 826.8772 862.0644 868.7215 884.4067 926.9374 934.1434 959.6840 960.5458 984.9596 995.0911 997.4436 1041.5562 1074.1102 1092.8439 1103.9314 1115.6083 1146.1613 1151.4912 1177.9556 1181.2158 1186.5892 1205.5878 1228.5749 1234.9213 1253.9995 1278.5751 1287.4807 1304.4856 1336.4488 1344.8259 1376.5957 1385.4805 1430.0892 1459.9940 1464.3074 1464.6063 1472.9687 1475.6337 1478.1704 1481.6334 1484.3221 1496.9090 1589.1535 1627.1718 2835.2483 2841.7574 2857.0928 2974.2610 3009.7795 3016.1453 3020.7807 3026.9968 3070.1506 3072.9146 3076.4732 3085.7407 3113.4667 3132.5165 3154.6318 3163.8664 3582.4768
redmass: 3.5550 2.4716 2.6682 3.5062 3.0192 4.3315 1.0677 1.4853 1.8466 2.9162 2.9708 2.8995 2.4042 1.1241 3.0517 2.3907 2.9716 3.1807 7.1256 3.8870 4.1161 5.6085 1.8909 4.0063 1.6203 2.4157 1.9852 2.7328 1.4736 1.5561 2.2706 2.0532 1.5108 1.6238 6.1271 2.0682 1.4608 2.2717 1.7772 1.5874 1.5301 1.3661 1.5958 1.7170 1.4009 1.3310 1.9857 1.9067 1.7941 1.9388 1.6338 1.4273 2.4937 1.3322 1.6041 1.4877 1.2035 7.3025 1.1684 2.7305 1.0909 1.1032 1.0700 1.1044 1.1448 1.4418 1.2661 1.0970 6.4664 6.2958 1.0691 1.0645 1.0654 1.0343 1.0661 1.0719 1.0847 1.0877 1.1017 1.1010 1.1026 1.1009 1.0878 1.0898 1.0979 1.0920 1.0660
irintensity: 0.2442 0.5234 1.4594 1.5436 2.0958 0.6824 0.3217 0.8241 1.1207 0.4441 1.5918 14.3366 3.3589 134.8384 6.9773 2.7878 3.8751 2.4994 1.6021 2.0654 1.2718 0.9107 37.6598 8.0382 42.2830 5.8572 14.5711 5.3550 1.8473 17.5420 65.6683 2.3175 2.9949 4.6608 1.1711 1.7404 2.0681 17.8808 14.5513 6.6162 7.3604 2.3726 83.7630 112.9244 0.2135 11.4055 7.5728 15.0464 4.1135 12.4104 3.6390 8.0472 42.8973 21.5270 7.8254 1.0900 18.0632 9.8521 0.7485 11.8314 17.9641 9.6415 4.7838 20.4903 4.2033 12.2862 16.3521 7.8225 70.9959 69.5582 79.1840 48.2051 231.5483 26.8239 22.6116 51.6578 62.5113 14.3800 20.0634 33.8233 39.0503 29.0027 11.1912 20.6370 23.7584 0.7618 32.0397
temp: 298.150 k
press: 1.00000 atm
elementType: 8 7 6 6 6 6 6 6 6 6 6 6 6 6 1 1 1 1 1 1 1 1 1 1 1 1 1 1 1 1 1
symmnumber: 1
zpe: 692623.4 jmol-1
zpe.correction: 0.263806 hartree
zpe.thermalcorrener: 0.277513 hartree
zpe.thermalcorrenthalpy: 0.278458 hartree
zpe.thermalcorrgfe: 0.223674 hartree
zpe.sumelectzpe: -596.364633 hartree
zpe.sumelectthermal: -596.350926 hartree
zpe.sumelectthermalent: -596.349982 hartree
zpe.sumelectthermalfe: -596.404765 hartree
dipole: -0.9660 -0.6916 -0.9863
dipole: 1.5441
quadrupole: -69.8866 -83.1619 -88.6142
quadrupole: 0.9976 0.0222 0.7463
quadrupole: 10.6677 -2.6077 -8.0600 0.9976 0.0222 0.7463
hfenergy: -596.6284393 hartree
pointgroup: C01 [X(C12H17N1O1)]
dipole: 0.3772453 0.3143631 -0.3576611 debye
polarizability: 176.9451008|-1.9409019|138.5910431|-5.8300602|-0.1889078|92.4686553 unknown
InChI: InChI=1S/C12H17NO/c1-12(6-7-13(2)9-12)10-4-3-5-11(14)8-10/h3-5,8,14H,6-7,9H2,1-2H3
charge 0 multiplicity 1
31 atoms
O  3.349798 -2.119635 -0.254766
N  -3.049204 -0.525688 -0.032701
C  -0.894275 0.360197 0.437544
C  -1.700162 1.439042 -0.385552
C  -1.635285 -0.952725 0.048681
C  -3.031818 0.746835 -0.799527
C  0.60497 0.347528 0.117319
C  -1.075965 0.615557 1.964259
C  -3.985606 -1.538119 -0.536196
C  1.325987 -0.86709 0.041209
C  1.316457 1.570063 -0.036947
C  2.719645 -0.860966 -0.191524
C  2.707627 1.568766 -0.268661
C  3.425603 0.354039 -0.349276
H  -1.134485 1.751264 -1.280278
H  -1.881177 2.33917 0.227595
H  -1.252371 -1.335006 -0.933946
H  -1.517973 -1.754824 0.800542
H  -3.92855 1.349363 -0.565412
H  -3.032581 0.554986 -1.903372
H  -0.53161 -0.14235 2.557387
H  -0.683567 1.610037 2.245507
H  -2.149062 0.564359 2.220071
H  -3.958103 -2.432919 0.11137
H  -3.76251 -1.861915 -1.585814
H  -5.015578 -1.13796 -0.517073
H  0.83018 -1.834922 0.160368
H  0.780265 2.523354 0.024012
H  3.242463 2.51776 -0.387835
H  4.508345 0.355949 -0.530746
H  4.319743 -2.01755 -0.420342
