program: Gaussian 09
title: 000102742
version: EM64L-G09RevD.01
frameworkgroup: C1[X(C19H24N2)]
method: RPBEPBE
basis: SDD
operation: Freq
keyword: #pfreq=noraman
keyword: PBEPBE/SDD
title: #p freq=noraman PBEPBE/SDD
converged: YES YES NO NO
title: Mulliken charges:
elementType: N N C C C C C C C C C C C C C C C C C C C H H H H H H H H H H H H H H H H H H H H H H H H
charge: -0.278653 -0.104538 -0.459080 -0.023729 0.163523 0.215042 -0.521543 -0.599367 0.328311 0.387056 -0.739211 -0.335303 -0.331321 -0.363539 -0.431671 -0.642897 -0.624050 -0.276448 -0.251821 -0.274612 -0.252096 0.228200 0.223659 0.248064 0.219241 0.236668 0.209892 0.219317 0.215168 0.219216 0.234478 0.262523 0.248319 0.225276 0.234663 0.221524 0.196012 0.235181 0.220052 0.226454 0.189214 0.225487 0.224987 0.226281 0.226073
chargesum: 0.00000
title: Mulliken charges with hydrogens summed into heavy atoms:
elementType: N N C C C C C C C C C C C C C C C C C C C
charge: -0.278653 -0.104538 -0.007221 0.224334 0.163523 0.215042 -0.065634 -0.170159 0.328311 0.387056 -0.070349 -0.072780 -0.083003 -0.138263 -0.197008 0.009820 0.011670 -0.050961 -0.026834 -0.048330 -0.026024
polarizability: 2.40680266e+02 2.60374380e+01 2.47772166e+02 -2.50017441e+01 1.26915046e+01 1.65555966e+02
1716.lowfreq: -3.5974 -0.0007 -0.0006 -0.0003 4.3787 13.2806 30.6870 37.1866 51.6683
frequency: 30.6431 37.0721 51.6616 56.3718 80.1715 113.4055 132.3952 156.7881 187.4984 200.1046 205.9913 224.2434 243.0734 255.4504 265.1632 268.4525 298.1157 319.5195 343.8364 379.5008 390.6368 416.6403 438.4194 455.6832 462.4245 495.6777 500.5726 530.1751 540.0821 559.6903 589.8504 605.6426 619.0924 675.5427 714.8141 741.0616 753.1601 757.8966 763.9888 777.5600 800.4956 847.5385 858.4279 861.0517 867.1331 918.2287 930.9794 938.7834 944.4504 966.2328 970.5157 975.2348 978.2501 1032.4932 1039.0607 1041.4589 1045.3544 1056.0478 1066.7612 1090.0252 1104.5502 1112.2144 1124.6404 1134.3871 1148.7199 1163.7428 1172.9318 1175.9907 1189.1946 1198.0194 1211.6802 1222.8459 1228.7039 1240.4665 1268.1305 1273.3932 1297.0752 1307.4973 1322.5844 1328.1125 1355.8050 1359.2095 1368.7357 1377.4036 1378.2352 1386.4171 1421.2541 1433.2114 1442.1786 1443.8462 1456.8646 1458.2480 1463.1672 1466.9496 1469.3653 1477.1209 1483.8051 1488.6195 1494.4213 1496.6830 1504.7403 1580.9524 1592.5837 1603.6430 1612.8786 2861.3487 2875.2477 2958.1478 2963.2412 2979.6092 2986.0740 3008.3358 3009.5905 3016.7309 3017.8230 3051.3709 3061.5256 3069.7361 3075.6021 3078.9290 3080.1126 3108.1724 3116.8612 3127.9318 3128.0991 3144.2823 3153.8334 3161.7018 3167.6124
redmass: 3.3152 3.8403 3.5246 3.6875 3.0316 3.4675 3.8517 3.1350 2.9466 1.0397 3.1396 1.1961 1.2603 2.1526 2.5913 3.3628 3.1731 4.4149 3.5056 2.5310 3.7741 2.6501 2.7399 3.5665 2.7968 2.8543 3.5545 3.0136 3.7689 4.4472 3.0722 4.7420 5.1607 5.1309 3.4369 3.0712 1.4894 2.5065 1.5622 2.7055 4.0819 2.3908 1.3375 2.3264 1.5967 1.9679 1.5764 1.5172 1.4272 1.8867 2.1542 1.3292 1.3229 3.5986 1.4884 3.1809 2.2223 2.2408 2.2478 1.2496 2.3096 1.9345 1.9939 1.7285 1.6821 1.1981 1.0603 1.2459 2.4862 1.6311 2.7062 2.1595 1.4216 1.4519 2.3279 1.5276 1.3840 1.6571 1.5123 1.5511 1.9959 1.4740 1.2880 2.6787 1.6530 3.1523 1.1463 2.1935 1.5113 1.5596 1.1534 1.0564 1.0985 1.1217 1.0489 1.0633 1.9958 1.0689 1.9436 1.1863 1.1711 6.5707 7.2449 6.1821 6.1275 1.0557 1.0558 1.0670 1.0613 1.0354 1.0633 1.0836 1.0735 1.0970 1.0747 1.1009 1.0948 1.1004 1.0993 1.0986 1.0985 1.0878 1.0868 1.0877 1.0878 1.0935 1.0943 1.1006 1.0975
irintensity: 0.0954 0.4262 0.2029 0.1216 0.0409 1.3499 0.0791 1.2256 1.1118 0.1775 3.1990 0.9689 1.0866 3.9983 0.0219 0.8626 1.5193 1.1972 1.7681 2.4673 6.6629 2.3856 2.8226 7.5439 5.6911 8.9984 0.7033 1.3080 0.5883 0.5010 5.6079 11.8005 11.5668 0.2410 1.2183 5.6805 29.8585 50.5995 83.9665 8.0091 1.8351 2.0955 4.3460 7.5526 0.5925 13.2378 5.7432 6.8467 1.2326 5.9759 2.3314 0.0206 0.0081 5.4703 12.8140 2.7250 10.2821 54.1556 16.8738 8.8733 13.9028 25.8014 47.5696 13.8186 22.8975 5.0114 0.1706 1.5975 44.7029 1.0680 18.9175 24.0521 13.2372 20.4060 11.7535 6.3078 2.1366 74.7320 23.4875 22.8879 25.9586 15.1143 8.1104 3.7001 15.8914 1.3950 10.0478 20.8043 12.7722 31.8051 19.8388 11.4363 15.1633 3.4183 15.6419 23.6960 191.3619 2.9172 9.2509 19.8379 13.0521 24.6951 10.7804 38.1522 16.4646 79.0683 167.7490 43.7595 30.0249 25.4582 21.0646 9.1480 47.0496 41.9851 46.4145 31.4052 14.5450 15.6162 46.3250 52.5842 44.4022 13.8625 8.7603 6.9631 13.0962 28.7810 30.3546 30.1243 16.5367
temp: 298.150 k
press: 1.00000 atm
elementType: 7 7 6 6 6 6 6 6 6 6 6 6 6 6 6 6 6 6 6 6 6 1 1 1 1 1 1 1 1 1 1 1 1 1 1 1 1 1 1 1 1 1 1 1 1
symmnumber: 1
zpe: 1010304.6 jmol-1
zpe.correction: 0.384805 hartree
zpe.thermalcorrener: 0.404418 hartree
zpe.thermalcorrenthalpy: 0.405363 hartree
zpe.thermalcorrgfe: 0.336896 hartree
zpe.sumelectzpe: -846.350404 hartree
zpe.sumelectthermal: -846.330790 hartree
zpe.sumelectthermalent: -846.329846 hartree
zpe.sumelectthermalfe: -846.398312 hartree
dipole: 0.5626 -0.9842 0.9489
dipole: 1.4784
quadrupole: -117.3022 -122.0805 -125.7925
quadrupole: -1.3631 -3.8728 4.5563
quadrupole: 4.4229 -0.3554 -4.0675 -1.3631 -3.8728 4.5563
hfenergy: -846.7352083 hartree
pointgroup: C01 [X(C19H24N2)]
dipole: 0.1184783 0.4247311 -0.3792906 debye
polarizability: 253.6134176|-24.2715731|235.5306372|20.9545933|17.6624893|164.864343 unknown
InChI: InChI=1S/C19H24N2/c1-15(20(2)3)14-21-18-10-6-4-8-16(18)12-13-17-9-5-7-11-19(17)21/h4-11,15H,12-14H2,1-3H3
charge 0 multiplicity 1
45 atoms
N  -0.10059 0.217143 0.194502
N  3.295753 1.881193 0.022793
C  0.931362 1.250465 0.470256
C  2.092775 1.225364 -0.566777
C  0.268314 -1.169882 0.296757
C  -1.472628 0.652081 0.2819
C  -1.709569 -2.116536 -1.191852
C  -1.994228 -0.714041 -1.780217
C  -0.467652 -2.24681 -0.30528
C  -2.42353 0.245102 -0.694975
C  1.62662 1.788303 -1.936126
C  1.449609 -1.49585 1.035443
C  -1.871029 1.536313 1.320079
C  -0.008201 -3.574279 -0.099164
C  -3.752947 0.719504 -0.600084
C  3.18222 3.335506 0.252507
C  4.55712 1.523924 -0.653972
C  1.881556 -2.822638 1.213258
C  -3.197022 2.012302 1.392594
C  1.14294 -3.885288 0.650081
C  -4.147974 1.602133 0.430308
H  0.419338 2.226064 0.414796
H  1.371395 1.165716 1.485531
H  2.378792 0.16698 -0.715172
H  -1.599725 -2.839767 -2.023617
H  -2.605346 -2.4374 -0.621724
H  -2.787125 -0.798832 -2.545785
H  -1.081042 -0.340551 -2.283427
H  1.340512 2.853801 -1.860803
H  2.418333 1.695149 -2.701664
H  0.743865 1.225279 -2.288954
H  2.036551 -0.698205 1.498325
H  -1.145611 1.831189 2.086052
H  -0.579034 -4.388305 -0.565157
H  -4.481071 0.403496 -1.357504
H  4.045207 3.673609 0.855302
H  3.166469 3.944973 -0.684809
H  2.266905 3.565257 0.824839
H  5.411828 1.877584 -0.047676
H  4.633437 0.425284 -0.741377
H  4.668322 1.961375 -1.677921
H  2.788619 -3.019182 1.796075
H  -3.488296 2.687764 2.204892
H  1.46063 -4.925228 0.778602
H  -5.180053 1.965641 0.481246
