program: Gaussian 09
title: 000102739
version: EM64L-G09RevD.01
frameworkgroup: C1[X(C13H11ClO)]
method: RPBEPBE
basis: SDD
operation: Freq
keyword: #p
keyword: freq=noraman
keyword: PBEPBE/SDD
title: #p freq=noraman PBEPBE/SDD
converged: YES YES NO NO
title: Mulliken charges:
elementType: Cl O C C C C C C C C C C C C C H H H H H H H H H H H
charge: -0.066457 -0.420815 -0.444814 -0.298783 -0.118403 -0.295843 0.037575 -0.734679 -0.128723 -0.284378 -0.040688 0.043255 0.001787 -0.046363 0.008913 0.266091 0.253938 0.200524 0.295494 0.240870 0.346383 0.236270 0.228666 0.236577 0.242252 0.241353
chargesum: 0.00000
title: Mulliken charges with hydrogens summed into heavy atoms:
elementType: Cl O C C C C C C C C C C C C C
charge: -0.066457 -0.074432 -0.178723 0.155678 0.177091 -0.054973 0.037575 -0.033167 0.113529 -0.043025 -0.040688 0.043255 0.001787 -0.046363 0.008913
polarizability: 6.55291044e+02 2.91701064e+01 9.94786140e+01 1.57925252e+01 9.48792668e+00 1.01039064e+02
1716.lowfreq: -10.5106 -1.0315 -0.0027 0.0005 0.0008 1.8260 11.1885 20.4919 26.0653
frequency: 6.1608 20.3302 25.9974 52.2937 58.6096 73.7962 88.3095 120.8957 139.4607 174.5113 186.3422 209.2938 223.4174 251.1549 286.2878 309.5524 342.8778 357.0156 371.3296 377.7946 429.6809 461.2687 472.0978 488.2740 508.7168 513.2027 552.8576 627.1393 659.4518 802.0744 846.0202 860.1734 881.3590 943.2344 946.9001 953.5138 972.8255 1029.3453 1039.3254 1117.1409 1122.9344 1155.8741 1162.4145 1193.2665 1225.5168 1273.0736 1277.1923 1288.4095 1313.9863 1333.8445 1381.7658 1394.5754 1426.0002 1446.9618 1454.8229 1465.9313 1605.2040 1629.8468 2095.8912 2198.3407 2225.7299 2944.3569 2966.5521 3037.9855 3061.8135 3072.1634 3079.5296 3084.0304 3097.4280 3118.9281 3138.4890 3565.9317
redmass: 2.4838 6.3191 4.1717 4.7808 5.5506 4.2168 3.7852 6.4548 3.4903 1.2040 5.1899 4.3505 4.0288 7.1773 3.6136 2.8679 3.4122 1.4277 3.9973 5.7876 6.9042 8.8993 6.9161 8.0244 10.3796 10.0724 5.3358 5.2725 4.5614 1.6168 2.4369 2.6141 2.8550 1.2397 2.1655 1.0747 1.2991 4.0334 1.5715 2.3537 2.6509 2.9945 1.1823 1.2309 1.2842 1.3365 1.2878 1.2719 1.5203 1.2416 1.2509 1.2265 4.8324 1.0786 1.0474 1.1325 5.8963 5.8202 11.9186 11.9684 11.9345 1.0694 1.0372 1.0960 1.0878 1.0881 1.0888 1.0977 1.0931 1.0912 1.0903 1.0664
irintensity: 1.0670 0.9790 0.5194 2.2745 2.9722 1.6401 1.1844 0.5406 2.1274 1.1148 16.0340 7.6468 0.1230 5.0696 13.1828 19.7190 40.0210 202.2864 37.1279 47.3648 17.3435 1.8227 5.3041 5.9796 4.7916 1.3630 50.1468 2.9092 34.8120 0.3178 28.1092 13.4356 13.2372 52.1700 42.4233 64.4860 67.3371 74.5634 0.3885 1.3704 36.9419 18.5188 13.0569 50.1150 11.3765 6.6463 20.8677 17.3944 6.6534 11.4947 28.9700 6.2853 8.2636 18.4583 16.9692 32.0275 150.0619 12.6634 43.4319 165.6233 3.5198 51.7051 43.1575 17.1321 19.6553 28.8869 33.2024 10.9194 18.7725 32.3268 11.7749 7.5036
temp: 298.150 k
press: 1.00000 atm
elementType: 17 8 6 6 6 6 6 6 6 6 6 6 6 6 6 1 1 1 1 1 1 1 1 1 1 1
symmnumber: 1
zpe: 500151.6 jmol-1
zpe.correction: 0.190498 hartree
zpe.thermalcorrener: 0.208209 hartree
zpe.thermalcorrenthalpy: 0.209153 hartree
zpe.thermalcorrgfe: 0.139661 hartree
zpe.sumelectzpe: -1036.007294 hartree
zpe.sumelectthermal: -1035.989583 hartree
zpe.sumelectthermalent: -1035.988639 hartree
zpe.sumelectthermalfe: -1036.058131 hartree
dipole: 4.6773 0.6051 -2.7935
dipole: 5.4815
quadrupole: -63.2122 -95.5821 -94.9373
quadrupole: 7.5619 22.3501 2.3409
quadrupole: 21.3650 -11.0049 -10.3601 7.5619 22.3501 2.3409
hfenergy: -1036.1977917 hartree
pointgroup: C01 [X(C13H11Cl1O1)]
dipole: 1.8113225 -0.1193862 -1.1643648 debye
dipolederiv: -1.0171612 0.0137411 0.2081618 -0.1159783 -0.1822742 0.0692394 0.8481783 0.0732334 -0.6368469 -0.3854803 -0.0887715 -0.2043828 0.2105303 -0.8057351 0.1227405 -0.3485169 0.0657904 -0.4136277 1.3682474 0.0312217 -0.3018474 0.3635403 0.0482137 -0.0478324 -0.6203164 -0.0635943 0.7631241 0.0657762 0.1313432 0.0676098 -0.1945448 0.6987319 -0.0480141 0.4019654 0.0111747 0.1936744 -0.7273554 -0.0038162 -0.0063748 0.2872363 -0.0411443 0.0988823 -0.4951394 0.1859816 -0.217251 0.8538871 0.0278474 0.0307418 0.0769822 0.1358223 0.0997479 0.1363821 0.0790708 -0.0894374 -0.6879646 -0.0069526 0.0067829 -0.2031316 -0.1148648 -0.0340944 -0.0971701 -0.0326547 -0.037248 -0.3856642 -0.0797037 -0.0228433 -0.416569 -0.0272733 -0.0271488 -0.148588 -0.0328865 0.055726 0.5591769 0.1168239 0.0326335 0.4152968 0.1666735 0.1241104 0.1497906 0.1320187 -0.1415623 -0.1793029 -0.0970542 -0.0336199 -0.6420438 -0.0316374 0.063058 -0.2400641 0.0503595 -0.1387611 0.5863232 0.0494494 0.0062284 0.0311992 -0.0236351 -0.0027724 -0.0024654 -0.0072368 -0.0165586 0.6582464 0.1070786 0.0283252 0.2136156 -0.0718666 -0.0276099 0.0768112 -0.0240134 -0.0216867 -0.5148643 -0.0302883 0.0028382 -0.0344673 -0.0214973 0.0072199 -0.0088388 0.0075943 -0.0352224 -0.7639252 -0.0930714 -0.0196648 -0.0359662 -0.0503208 0.0037235 -0.0103758 0.0036984 -0.056795 0.7918298 0.0673439 0.0086789 0.0574764 0.0017642 -0.0025066 0.0167623 -0.0018011 0.0044427 0.0427647 0.0099556 0.0277917 -0.0772051 -0.0794036 -0.0479046 -0.037934 -0.0478587 -0.0487759 -0.1515361 -0.0343035 0.0085219 0.0957569 0.0317158 0.0024321 0.040778 0.0031236 0.1124796 0.1353446 0.0103683 0.027531 -0.0122323 -0.062344 -0.0144148 -0.0224047 -0.0618886 -0.1925699 0.0348963 -0.0343703 0.0033233 -0.115791 0.0123344 -0.0658105 -0.0282082 -0.0683737 0.1472388 -0.0874213 -0.0913158 -0.0403715 -0.1058433 0.0007866 -0.0572798 -0.0275836 -0.0646508 0.1368085 0.1472769 -0.0470762 0.1417229 -0.2259594 0.3512652 -0.0816997 0.2526861 -0.0787733 0.2814155 -0.0983674 -0.0798673 0.0191306 -0.0172264 -0.0089011 0.1140287 0.1414262 0.1240529 0.0536692 0.0198747 0.0290783 0.0118765 0.1735021 -0.0739758 -0.0719215 0.0644581 -0.0702597 0.0862806 -0.1019535 -0.0511335 -0.0633533 0.0775648 0.1362519 -0.0467165 -0.1179674 -0.0538342 -0.0860541 -0.0226262 0.0735359 0.0295209 0.1065242 -0.0093375 -0.0674438 0.0419413 -0.066615 0.1395064 -0.1400217 0.0699372 0.0310386 0.0877336 0.0206514 -0.0620127 0.0343931 -0.0616576 0.1580311 unknown
polarizability: 654.6905414|36.875666|105.9841848|-9.2300802|7.0367401|95.1339959 unknown
InChI: InChI=1S/C13H11ClO/c1-2-3-4-5-6-7-8-9-10-11-13(14)12-15/h2-3,10-11,13,15H,12H2,1H3
charge 0 multiplicity 1
26 atoms
Cl -6.134109 -0.304663 1.814285
O  -5.849885 2.25946 -0.408443
C  -5.467947 -0.206629 -0.002632
C  -6.248039 0.897457 -0.748662
C  -3.995439 0.011515 0.080654
C  -3.072074 -0.930136 -0.309404
C  -1.667328 -0.758609 -0.255026
C  8.413316 1.051837 0.312021
C  6.910371 0.976746 0.300167
C  6.190651 -0.120667 -0.105412
C  -0.419508 -0.658882 -0.233864
C  4.772941 -0.194449 -0.118123
C  0.92798 -0.53889 -0.203736
C  3.527185 -0.313907 -0.149196
C  2.17899 -0.429346 -0.176928
H  -5.727065 -1.194806 -0.419063
H  -7.316437 0.832754 -0.490275
H  -6.130678 0.704677 -1.838668
H  -3.658871 0.96226 0.51114
H  -3.433022 -1.896535 -0.695938
H  -4.967237 2.458294 -0.81125
H  8.771507 1.880236 -0.330521
H  8.876685 0.114448 -0.04067
H  8.78936 1.263462 1.332344
H  6.360393 1.865435 0.640757
H  6.73346 -1.014962 -0.447756
