program: Gaussian 09
title: 000102735
version: EM64L-G09RevD.01
frameworkgroup: C1[X(C19H26N2O)]
method: RPBEPBE
basis: SDD
operation: Freq
keyword: #p
keyword: freq=noraman
keyword: PBEPBE/SDD
title: #p freq=noraman PBEPBE/SDD
converged: NO YES NO NO
title: Mulliken charges:
elementType: O N N C C C C C C C C C C C C C C C C C C C H H H H H H H H H H H H H H H H H H H H H H H H H H
charge: -0.291485 -0.144715 -0.090410 -0.149638 -0.147856 -0.442795 -0.438230 -0.368256 -0.397736 0.206203 -0.493960 -0.472005 0.391562 -0.674896 -0.845658 -0.438589 0.435306 -0.403417 -0.383740 -0.244306 -0.245961 -0.243528 0.241184 0.281489 0.213871 0.226471 0.230654 0.210450 0.239214 0.191632 0.214636 0.221496 0.205430 0.205668 0.219982 0.222861 0.201868 0.232645 0.229541 0.224385 0.242409 0.258458 0.212179 0.229123 0.249197 0.225786 0.224461 0.229021
chargesum: 0.00000
title: Mulliken charges with hydrogens summed into heavy atoms:
elementType: O N N C C C C C C C C C C C C C C C C C C C
charge: -0.291485 -0.144715 -0.090410 0.091546 0.133633 -0.002453 0.002874 0.062590 0.038396 0.206203 -0.082863 -0.029162 0.391562 -0.010842 -0.120405 -0.226410 0.435306 -0.174294 -0.134543 -0.018520 -0.021500 -0.014508
polarizability: 3.01430488e+02 -1.74627900e+01 2.20178485e+02 -3.01786713e+01 -3.02681408e+00 1.58745139e+02
1716.lowfreq: -16.4339 -0.7982 -0.0001 0.0002 0.0004 2.8920 14.9026 21.0199 29.7589
frequency: 11.9414 20.8095 29.7549 40.7634 48.9334 64.2032 91.6930 100.5039 125.0553 145.0392 156.5252 180.5723 194.7487 217.6220 225.5537 270.4509 281.7160 295.6647 311.5010 329.3212 352.4168 363.5746 390.0365 410.4918 434.2230 472.0011 484.6665 507.6915 524.5137 532.3528 566.7497 615.1583 624.3872 653.7970 690.6317 702.8137 753.8171 754.0112 768.7977 792.7028 802.6815 803.8834 840.1989 849.2354 850.3251 863.8700 883.3933 905.2266 921.2986 928.6793 931.8384 951.3372 977.1128 985.0713 987.9944 994.4846 1005.1322 1014.6023 1018.2041 1021.9868 1035.3319 1042.5752 1045.7603 1073.2983 1083.9592 1085.9482 1090.2173 1120.3556 1124.8292 1160.6433 1163.4320 1172.1941 1188.1606 1194.2294 1194.7465 1203.2642 1223.6278 1235.0354 1246.1484 1251.3081 1262.2037 1270.7845 1283.2858 1291.5585 1300.8173 1311.3091 1324.0278 1324.2574 1334.0615 1352.5960 1363.3279 1374.5642 1382.5563 1393.5851 1400.1954 1409.9277 1438.2230 1448.4724 1450.9036 1456.6628 1461.6972 1464.8503 1465.3062 1470.2154 1477.2075 1479.2065 1483.5463 1487.5190 1580.7546 1581.9629 1610.7827 1661.4646 2843.9090 2861.1724 2880.5550 2960.6655 2966.9642 2976.2690 2997.0843 3012.0427 3016.1608 3019.7685 3026.5158 3029.8369 3044.2328 3065.4484 3070.1730 3075.5722 3082.7452 3089.5424 3092.8313 3097.0304 3105.7797 3115.6336 3126.5745 3140.2817 3158.8702 3176.9241
redmass: 4.2416 3.8064 4.1942 3.3866 3.9497 3.0409 2.2855 4.0043 3.1765 3.4999 1.9386 2.2255 1.2757 1.9866 2.2545 3.1146 3.1467 3.2196 2.8540 2.6332 2.4352 2.9330 3.1769 2.8183 2.7667 3.1793 3.7318 3.8442 3.0386 2.8074 3.4594 6.2142 3.5140 3.9991 3.1574 1.6998 3.2173 4.1554 2.3937 1.6777 1.4047 3.0915 2.8265 2.7573 1.2548 3.0460 1.4153 2.8010 2.8754 1.6786 1.6513 1.5855 1.4260 2.4263 4.7999 1.3350 1.6481 1.6570 1.9776 2.2994 1.7384 1.8043 1.7284 1.5792 1.9267 1.7482 2.4480 2.1945 2.6138 1.5369 1.6638 1.0685 1.8615 1.1839 1.2729 1.5326 1.5900 1.9179 1.5415 1.1916 1.3784 1.4099 1.6135 1.5458 1.3801 1.5116 1.5690 1.5764 1.3744 1.4444 1.8307 1.4264 1.9763 1.2394 1.7997 3.7975 2.1194 1.1073 1.0830 1.0896 1.0687 1.0548 1.0645 1.0961 1.0960 1.0580 2.0808 1.1114 5.6780 8.2294 6.0279 7.1380 1.0708 1.0683 1.0689 1.0400 1.0596 1.0886 1.0367 1.0600 1.0996 1.0895 1.0633 1.0880 1.0924 1.0875 1.0945 1.0962 1.0997 1.0902 1.0997 1.1035 1.1001 1.0866 1.0870 1.0934 1.0984 1.0955
irintensity: 0.5987 0.0976 0.5979 0.1755 1.2104 0.0589 4.4092 1.4143 0.7721 0.4992 0.3510 3.3806 1.6219 0.1428 1.9510 6.8703 2.1720 3.4042 0.9503 1.8197 9.5453 0.2062 1.6284 0.2324 1.6919 1.6897 0.3708 8.5737 9.9326 9.9804 3.4618 0.4105 2.5188 4.6523 0.3598 51.4466 6.4608 2.7008 40.2857 4.6879 16.3571 0.7106 21.4132 3.7442 0.9474 2.7045 23.1240 2.5616 6.5106 8.7558 9.2483 4.4145 0.6907 7.0290 0.6207 1.9279 29.2284 4.0321 74.2188 11.8817 0.0781 1.9514 6.1618 0.4395 13.6003 5.0618 3.8579 20.7265 49.1409 2.2175 12.0613 0.2338 6.1967 3.6478 7.3811 26.3688 1.0244 1.9812 20.0777 0.5729 4.5805 11.3217 47.5356 6.2073 9.4499 1.5875 4.5568 2.5162 14.0967 16.6876 5.7772 13.2797 12.0449 9.8053 28.8833 216.3664 9.2894 30.2344 4.1338 3.5160 3.5162 7.4342 9.3984 29.2965 9.4353 15.8090 18.6910 7.2303 3.9806 333.1107 9.5253 8.2488 58.6240 57.9483 122.4464 20.1314 33.2125 29.2644 36.6157 20.8379 15.3090 35.3047 57.8737 28.4755 14.4215 21.8731 20.9596 7.3634 13.3814 13.3709 30.3107 61.4829 31.9652 9.9263 0.2261 31.6166 40.7864 10.1019
temp: 298.150 k
press: 1.00000 atm
elementType: 8 7 7 6 6 6 6 6 6 6 6 6 6 6 6 6 6 6 6 6 6 6 1 1 1 1 1 1 1 1 1 1 1 1 1 1 1 1 1 1 1 1 1 1 1 1 1 1
symmnumber: 1
zpe: 1079266.4 jmol-1
zpe.correction: 0.411071 hartree
zpe.thermalcorrener: 0.432464 hartree
zpe.thermalcorrenthalpy: 0.433408 hartree
zpe.thermalcorrgfe: 0.357667 hartree
zpe.sumelectzpe: -922.676951 hartree
zpe.sumelectthermal: -922.655558 hartree
zpe.sumelectthermalent: -922.654614 hartree
zpe.sumelectthermalfe: -922.730355 hartree
dipole: -3.2293 -0.3610 2.0850
dipole: 3.8608
quadrupole: -154.6560 -122.0083 -134.1234
quadrupole: -1.8469 8.1103 1.6505
quadrupole: -17.7268 14.9209 2.8058 -1.8469 8.1103 1.6505
hfenergy: -923.0880218 hartree
pointgroup: C01 [X(C19H26N2O1)]
dipole: 1.241435 -0.0627634 0.8729917 debye
polarizability: 301.5438144|-22.814208|210.5231972|27.6841607|20.5622325|168.2871005 unknown
InChI: InChI=1S/C19H26N2O/c1-3-19(22)21-17-9-10-18(21)14-20(13-17)12-15(2)11-16-7-5-4-6-8-16/h4-8,11,17-18H,3,9-10,12-14H2,1-2H3
charge 0 multiplicity 1
48 atoms
O  -5.131283 -0.36631 -1.347875
N  -3.416023 -0.085484 0.183547
N  -0.846599 1.123764 -0.268326
C  -2.257737 -0.455222 1.036181
C  -3.303086 1.387573 0.032761
C  -2.330553 0.614709 2.167726
C  -3.034442 1.844181 1.496377
C  -0.976937 -0.286571 0.174011
C  -2.087091 1.66176 -0.889271
C  -4.289228 -0.876768 -0.540389
C  0.361665 1.367044 -1.093534
C  -4.196478 -2.393646 -0.293284
C  1.666466 1.154791 -0.326692
C  -5.272265 -3.174119 -1.06896
C  1.815627 1.996353 0.926224
C  2.576988 0.251334 -0.810953
C  3.921823 -0.113416 -0.318002
C  4.455404 -1.37719 -0.711562
C  4.742853 0.725291 0.493284
C  5.731078 -1.80256 -0.289609
C  6.02284 0.302389 0.911564
C  6.522535 -0.964729 0.531185
H  -2.332899 -1.489407 1.407198
H  -4.22494 1.78829 -0.415765
H  -1.321633 0.86859 2.533653
H  -2.925099 0.23085 3.015192
H  -3.987974 2.078722 2.000395
H  -2.394589 2.742001 1.520663
H  -0.079102 -0.555424 0.760258
H  -1.036411 -0.994599 -0.693224
H  -2.299264 1.204292 -1.887115
H  -1.957709 2.751006 -1.036127
H  0.368112 0.735093 -2.017187
H  0.308402 2.424754 -1.428344
H  -3.185348 -2.743633 -0.58631
H  -4.287668 -2.592171 0.793769
H  -5.164655 -4.260091 -0.89388
H  -5.193197 -2.977175 -2.151152
H  -6.283754 -2.862839 -0.758125
H  2.306648 2.966511 0.707995
H  2.409619 1.489329 1.705814
H  0.81055 2.217591 1.328383
H  2.260465 -0.321711 -1.697622
H  3.850664 -2.031296 -1.352466
H  4.398368 1.725576 0.767488
H  6.111063 -2.781613 -0.602798
H  6.637514 0.968692 1.52777
H  7.516782 -1.288912 0.857933
