program: Gaussian 09
title: 000102730
version: EM64L-G09RevD.01
frameworkgroup: C1[X(C6H12O)]
method: RPBEPBE
basis: SDD
operation: Freq
keyword: #pfreq=noraman
keyword: PBEPBE/SDD
title: #p freq=noraman PBEPBE/SDD
converged: YES YES NO NO
title: Mulliken charges:
elementType: O C C C C C C H H H H H H H H H H H H
charge: -0.452531 -0.019224 -0.545827 0.514323 -0.689371 -0.807642 -0.746788 0.184820 0.192999 0.225447 0.198994 0.238476 0.223237 0.226780 0.229147 0.230428 0.339354 0.234865 0.222513
chargesum: 0.00000
title: Mulliken charges with hydrogens summed into heavy atoms:
elementType: O C C C C C C
charge: -0.113176 0.165595 -0.127381 0.514323 -0.028664 -0.121287 -0.289410
polarizability: 7.89123834e+01 7.72879174e+00 7.36317415e+01 -1.29605193e+00 3.11040381e+00 5.43539712e+01
1716.lowfreq: -8.7096 0.0008 0.0008 0.0010 8.2438 27.5190 62.9354 90.4958 164.7954
frequency: 62.6841 90.4127 164.7859 183.4770 201.1965 297.1953 371.3076 389.0238 425.8986 427.0739 464.6715 545.4281 703.6160 815.8814 823.4346 910.2310 913.9121 942.1489 977.7784 993.3531 1035.7614 1056.9636 1082.1766 1115.2445 1187.4264 1251.5710 1266.4539 1299.2469 1320.1389 1373.9744 1391.4418 1394.9851 1423.8525 1446.2140 1457.6647 1464.0504 1476.1513 1478.8089 1658.1360 2924.3192 2965.6167 2983.6216 2989.9242 3039.0789 3052.8702 3086.6488 3087.0723 3089.5537 3098.1075 3190.2348 3485.3156
redmass: 3.2582 2.8132 2.3209 1.2004 1.0606 2.6564 2.8148 1.8290 1.5793 1.5955 2.2644 2.5391 1.1480 2.6395 2.8706 1.9860 1.5250 1.3254 1.6985 1.3521 1.6595 1.8644 1.6031 2.1590 1.3573 1.1316 1.3294 2.5986 1.2531 1.3794 1.3938 1.2655 1.1807 1.1001 1.0515 1.0526 1.0589 1.0566 4.7845 1.0839 1.0377 1.0582 1.0371 1.0965 1.1017 1.0717 1.0889 1.0997 1.0999 1.1142 1.0654
irintensity: 1.4631 0.6624 0.6784 0.2924 1.2938 0.8955 5.6094 49.1083 45.6383 56.0245 6.5832 11.9189 2.6057 4.3587 13.5236 6.7882 1.4074 67.5080 6.2175 0.8678 15.9310 40.6909 7.3167 26.8964 7.1488 47.6897 4.1367 13.6031 13.4225 20.3446 25.6968 41.0787 1.2559 5.1670 4.9859 24.0409 19.2847 5.6687 26.2722 61.8455 25.5510 19.7869 34.6412 22.5194 22.6679 16.7397 13.2284 42.2825 29.6805 22.7533 8.9606
temp: 298.150 k
press: 1.00000 atm
elementType: 8 6 6 6 6 6 6 1 1 1 1 1 1 1 1 1 1 1 1
symmnumber: 1
zpe: 435896.1 jmol-1
zpe.correction: 0.166024 hartree
zpe.thermalcorrener: 0.175001 hartree
zpe.thermalcorrenthalpy: 0.175945 hartree
zpe.thermalcorrgfe: 0.132702 hartree
zpe.sumelectzpe: -310.452542 hartree
zpe.sumelectthermal: -310.443566 hartree
zpe.sumelectthermalent: -310.442622 hartree
zpe.sumelectthermalfe: -310.485864 hartree
dipole: 1.5132 -1.6906 0.3646
dipole: 2.2980
quadrupole: -46.1948 -44.3542 -45.6293
quadrupole: 3.5810 -3.4096 1.3823
quadrupole: -0.8021 1.0386 -0.2365 3.5810 -3.4096 1.3823
hfenergy: -310.6185663 hartree
pointgroup: C01 [X(C6H12O1)]
dipole: -0.5670719 0.6784365 0.1885472 debye
dipolederiv: -0.3751998 -0.0459794 0.085653 -0.0227154 -0.6693745 -0.1331354 0.1192743 -0.1443964 -0.6525814 0.4453466 0.0667524 -0.0222075 0.0057654 0.5782678 0.0669741 -0.1583568 0.0607499 0.4423161 -0.2793323 0.0166707 0.0370915 -0.0157517 0.0536531 0.0029685 0.0750167 0.0416295 0.0112263 0.2208905 0.0357146 0.1493432 0.0823529 0.3328036 -0.1066506 0.2708425 -0.1075466 -0.0429983 -0.143154 -0.0568959 -0.0732869 0.0209966 0.0761172 -0.0151455 0.0053369 -0.0050471 0.0234151 -0.008817 0.0259421 -0.0489279 0.0468282 -0.1202287 0.0906398 -0.0659194 0.0638993 0.0352102 -0.1644831 -0.0118312 0.2110094 -0.0445174 -0.2705286 -0.1048185 0.1730163 -0.1306318 -0.3067054 0.0006987 0.0500028 -0.0438414 0.0226203 -0.1660262 0.0949994 -0.0277745 0.1185185 -0.1218642 0.0556847 -0.0119179 0.0072523 -0.0246889 -0.119316 -0.1218013 -0.0341805 -0.0982955 0.0297324 0.0227745 0.0199108 -0.028829 0.0272186 -0.0267013 0.144191 -0.0421737 0.0718993 -0.0307289 0.0875049 0.0170312 -0.0054093 -0.0389157 -0.1284428 -0.0991914 -0.0316357 -0.0894281 0.0545306 -0.0894763 -0.0000823 0.0942384 0.0268266 0.1048834 -0.0131778 0.1274463 -0.0143492 -0.0068781 0.0758203 -0.0162092 -0.0044773 0.0367829 -0.008455 0.1340829 -0.0545693 0.1076104 -0.0405673 0.0047546 -0.0634721 0.1285182 -0.0537838 0.0430583 0.0501696 0.0938363 0.0954946 0.0042018 0.100648 0.0463066 -0.0102207 0.0374517 -0.0650075 -0.0806845 0.0322836 -0.1201987 -0.0145084 -0.1009936 0.0010021 -0.1220866 -0.0694818 0.070261 -0.0300375 -0.1048807 0.009784 0.0438072 0.1387415 -0.080341 -0.1367821 -0.0567186 0.2403286 -0.0019595 -0.1462993 0.0139879 0.3535729 0.074056 0.0543498 -0.0921974 0.0419662 -0.016755 0.0941763 -0.0842271 0.1082683 0.1025076 -0.0654641 -0.0469542 -0.12484 -0.0222361 0.0914625 0.0284005 -0.1470359 0.0180518 0.1163119 unknown
polarizability: 79.4827586|7.2316839|73.2130587|3.5028472|-0.5686294|54.2022789 unknown
InChI: InChI=1S/C6H12O/c1-5(2)4-6(3)7/h6-7H,1,4H2,2-3H3
charge 0 multiplicity 1
19 atoms
O  1.240247 -1.176808 -0.839565
C  1.232813 0.155787 -0.215916
C  0.069124 0.270184 0.816385
C  -1.295003 0.10581 0.159177
C  2.608944 0.334494 0.43235
C  -1.859552 1.32715 -0.544965
C  -1.944187 -1.093015 0.166024
H  1.090801 0.931836 -1.002397
H  0.140771 1.257099 1.315673
H  0.223994 -0.512793 1.582323
H  2.710942 1.34701 0.86362
H  3.40217 0.189592 -0.320841
H  2.755492 -0.412101 1.232958
H  -1.139473 1.738102 -1.279585
H  -2.062035 2.135843 0.184601
H  -2.800012 1.100364 -1.075243
H  0.303778 -1.408128 -1.083267
H  -1.543503 -1.959289 0.706324
H  -2.908307 -1.227737 -0.338558
