program: Gaussian 09
title: 000009223
version: EM64L-G09RevD.01
frameworkgroup: C1[X(C8H6O)]
method: RPBEPBE
basis: SDD
operation: Freq
keyword: #p
keyword: freq=noraman
keyword: PBEPBE/SDD
title: #p freq=noraman PBEPBE/SDD
converged: NO YES NO YES
title: Mulliken charges:
elementType: O C C C C C C C C H H H H H H
charge: -0.240232 0.268943 0.179735 -0.387365 -0.367926 -0.331226 -0.231285 -0.209123 -0.156898 0.244458 0.262864 0.251418 0.225394 0.229709 0.261533
chargesum: 0.00000
title: Mulliken charges with hydrogens summed into heavy atoms:
elementType: O C C C C C C C C
charge: -0.240232 0.268943 0.179735 -0.142907 -0.105062 -0.079808 -0.005891 0.020586 0.104636
polarizability: 1.21039139e+02 -1.38790575e+00 8.89138471e+01 1.37246163e-03 7.51946912e-04 3.48230393e+01
1716.lowfreq: -15.0851 -5.7406 -0.0008 -0.0006 -0.0004 10.7847 211.6269 244.9028 389.9186
frequency: 211.6268 244.9022 389.9183 419.7587 529.9702 563.4379 582.1932 602.1781 739.7221 751.2936 753.4649 772.8411 828.7107 856.0651 870.5058 884.1614 940.6724 978.5411 990.6603 1007.3847 1085.2423 1120.6342 1155.8575 1164.0034 1241.1745 1261.4583 1325.5889 1411.2624 1435.2123 1463.5810 1522.4961 1595.3786 1624.3427 3131.8363 3146.0614 3161.1214 3176.1159 3221.9828 3262.9090
redmass: 4.1527 4.4562 4.2907 2.8879 6.9989 4.0710 3.2874 6.8964 1.9034 5.3778 1.4560 1.6023 6.3499 1.3133 1.4420 5.0296 1.3827 1.3065 3.1771 2.0876 2.2070 1.3653 1.8169 1.1638 2.2184 1.5832 1.8974 4.1753 3.2184 2.9244 4.7749 7.0270 7.8957 1.0856 1.0907 1.0965 1.0988 1.0923 1.1073
irintensity: 8.1799 0.5315 5.9755 11.2172 0.3249 0.0818 0.1441 0.8569 11.5551 5.2328 67.6271 96.1392 9.3262 0.4829 9.6558 1.3511 6.5218 0.0098 19.1987 7.4303 14.6088 17.7604 24.2148 0.8763 7.6826 1.7266 8.9554 8.8637 23.8825 7.5831 7.6322 0.2297 0.2437 1.4594 12.4135 23.9316 10.7999 2.1330 0.7807
temp: 298.150 k
press: 1.00000 atm
elementType: 8 6 6 6 6 6 6 6 6 1 1 1 1 1 1
symmnumber: 1
zpe: 301604.1 jmol-1
zpe.correction: 0.114875 hartree
zpe.thermalcorrener: 0.121006 hartree
zpe.thermalcorrenthalpy: 0.121950 hartree
zpe.thermalcorrgfe: 0.084599 hartree
zpe.sumelectzpe: -383.040036 hartree
zpe.sumelectthermal: -383.033905 hartree
zpe.sumelectthermalent: -383.032961 hartree
zpe.sumelectthermalfe: -383.070311 hartree
dipole: 0.0456 1.0548 0.0000
dipole: 1.0558
quadrupole: -42.9044 -47.0330 -56.5969
quadrupole: -2.8962 0.0004 0.0000
quadrupole: 5.9404 1.8118 -7.7521 -2.8962 0.0004 0.0000
hfenergy: -383.1549106 hartree
pointgroup: C01 [X(C8H6O1)]
dipole: 0.0177768 0.4150138 0.000005 debye
dipolederiv: -0.6513528 0.1715209 -0.0000045 -0.1502141 -0.5899319 -0.0000139 -0.0000065 0.0000058 -0.1388134 0.190037 0.0297917 -0.0000058 -0.2061041 -0.1748439 -0.0000057 -0.0000047 -0.0000017 0.0408484 0.4456578 0.0307055 0.0000018 0.3718963 0.0555459 0.0000043 0.0000149 0. 0.0357976 0.0324435 -0.0138842 0.0000054 0.0334914 0.128659 0.0000035 0.0000096 0.0000058 -0.1705316 -0.1047878 -0.1815185 0.0000022 -0.053441 -0.0769929 0.0000051 -0.0000038 -0.0000084 -0.2357342 -0.0201222 -0.0410374 0.0000031 -0.0331254 0.0601835 0.0000008 -0.0000019 -0.0000058 -0.1537798 0.019341 0.0880658 0.0000036 0.1422912 -0.0374296 0.0000044 0.0000029 0.0000013 -0.1726514 -0.03234 -0.0243543 0.0000068 -0.0815372 0.0510451 -0.0000033 0.000011 0.0000005 -0.1816636 0.0323996 -0.0962907 0.0000106 -0.0760854 0.5721407 0.0000135 -0.0000027 0.0000077 -0.1201643 0.0809363 0.012491 -0.0000004 -0.0183591 -0.0988153 -0.0000018 -0.0000018 -0.0000055 0.1673538 0.0725782 0.0429139 -0.0000014 0.0869432 -0.0021042 -0.0000023 -0.0000005 0.0000008 0.1990922 0.0961497 -0.0179097 -0.0000021 0.0082834 -0.0609129 0.0000001 -0.0000039 0.0000015 0.1823364 -0.0900088 -0.0909296 -0.0000064 -0.0914054 0.039982 -0.0000019 -0.0000062 -0.0000017 0.1657222 -0.0710981 0.0948919 -0.0000055 0.0890144 0.0350189 0.0000015 -0.0000079 0.0000028 0.1661359 0.0001667 -0.0044562 -0.0000074 -0.0216481 0.0984555 -0.0000043 0.0000014 -0.0000031 0.2160518 unknown
polarizability: 121.0401736|-1.3758791|88.9128125|0.0013722|0.0007525|34.8230393 unknown
InChI: InChI=1S/C8H6O/c1-2-4-8-7(3-1)5-6-9-8/h1-6H
charge 0 multiplicity 1
15 atoms
O  -1.576013 -1.176732 -0.000025
C  -0.271966 0.747812 0.000016
C  -0.252569 -0.679463 -0.000008
C  0.963884 1.443984 0.000021
C  -1.67671 1.134194 0.000027
C  0.918804 -1.450049 0.000006
C  2.157102 0.691494 0.000046
C  2.137159 -0.733745 0.000033
C  -2.411694 -0.031918 -0.000043
H  0.992799 2.538708 0.000029
H  -2.081399 2.144412 0.000043
H  0.886698 -2.54318 0.00001
H  3.123159 1.208262 0.000073
H  3.083687 -1.284945 0.000057
H  -3.478441 -0.240934 -0.000085
