program: Gaussian 09
title: 000102690
version: EM64L-G09RevD.01
frameworkgroup: C1[X(C19H22ClNO2)]
method: RPBEPBE
basis: SDD
operation: Freq
keyword: #p
keyword: freq=noraman
keyword: PBEPBE/SDD
title: #p freq=noraman PBEPBE/SDD
converged: YES YES NO NO
title: Mulliken charges:
elementType: Cl O O N C C C C C C C C C C C C C C C C C C C H H H H H H H H H H H H H H H H H H H H H H
charge: -0.066352 -0.232334 -0.299676 -0.078316 -0.377841 -0.382186 -0.387778 -0.293928 -0.318424 -0.239286 -0.266794 0.380002 0.477440 -0.377330 -0.413531 -0.449342 -0.351666 -0.213399 -0.200803 -0.225382 -0.227573 -0.114453 -0.241725 0.179786 0.229319 0.204365 0.213777 0.228301 0.192969 0.164091 0.235222 0.231574 0.178782 0.206730 0.206888 0.209345 0.250051 0.283459 0.235894 0.255308 0.253935 0.253092 0.228738 0.228447 0.230603
chargesum: 0.00000
title: Mulliken charges with hydrogens summed into heavy atoms:
elementType: Cl O O N C C C C C C C C C C C C C C C C C C C
charge: -0.066352 -0.232334 -0.299676 -0.078316 0.031265 0.035955 0.033492 0.105385 0.091933 0.174332 -0.057449 0.380002 0.477440 -0.127279 -0.130072 -0.213448 -0.096358 0.040536 0.052289 0.003356 0.000875 -0.114453 -0.011122
polarizability: 2.65756711e+02 2.56981773e+01 2.41924541e+02 -8.20374511e+00 -1.10568641e+01 1.62603550e+02
1716.lowfreq: -13.4596 0.0011 0.0023 0.0024 2.6174 5.6590 9.6067 13.3251 21.7379
frequency: -10.2604 13.2905 21.6465 29.5902 35.8118 48.9563 60.3385 87.4076 98.6584 127.1621 162.3647 183.9018 187.2941 236.9955 242.1604 252.9071 288.2372 298.7748 314.0553 329.8125 375.3235 401.1306 402.2839 409.1317 440.6007 445.5189 455.9920 481.0960 501.4445 549.6675 609.0866 615.4594 624.3327 630.9936 673.8207 704.9472 714.1972 766.9045 773.1966 793.4669 806.0135 831.7059 835.7762 848.3818 855.3133 868.6844 891.7679 902.2698 925.4093 939.9038 953.8529 962.8244 977.8742 984.2470 990.3652 997.8486 999.0349 1001.7340 1022.5582 1028.2056 1046.8905 1057.4284 1070.5040 1071.2023 1080.0152 1093.9819 1107.9578 1108.9400 1150.5798 1172.5840 1175.5713 1177.5069 1180.7234 1183.0539 1187.3556 1204.1514 1212.2062 1244.2568 1269.6372 1273.7252 1283.9569 1286.7502 1290.3409 1296.7413 1330.5164 1334.0529 1343.6461 1348.6347 1369.1829 1372.1056 1380.3823 1386.7101 1389.0845 1405.4237 1440.8594 1442.6096 1452.9884 1461.2817 1471.5512 1474.4015 1475.7573 1480.8322 1487.9488 1586.0718 1594.5980 1600.6618 1611.4350 2782.6030 2829.1748 2900.4256 2905.4754 2926.6543 2953.7443 3000.5165 3007.1060 3040.0361 3051.9005 3071.3324 3075.9354 3088.0513 3109.9869 3125.7428 3136.1045 3137.0804 3148.4687 3160.3939 3163.8905 3170.0716 3184.0856
redmass: 3.3587 3.7728 5.2856 4.2142 5.4603 5.7574 5.0590 4.0262 2.7255 3.8830 4.3181 6.4118 5.3447 3.9505 4.4574 2.2516 3.6967 5.0510 2.9900 4.3701 4.7648 2.2817 2.3199 2.9385 4.3985 4.6297 3.5305 3.2679 3.7622 3.5177 3.8002 6.1594 6.4190 3.9584 4.7098 1.7126 4.2193 2.4643 2.5006 2.1508 1.2605 3.0966 1.3358 2.3647 1.2496 2.6294 1.4025 2.7459 1.8564 3.2250 2.6891 1.4291 1.3954 1.3553 6.1415 1.3369 4.1255 3.0880 3.2828 3.4825 2.2408 2.4315 2.3021 2.6430 1.6209 2.4082 1.3607 2.0720 1.8552 1.0847 1.2718 1.3371 1.5866 1.2369 1.6535 1.5689 1.8869 1.4589 1.5909 1.1813 1.2233 1.3326 1.2887 1.2701 1.3187 1.2880 1.3167 1.3858 1.3851 4.5603 1.4591 4.6001 3.7507 1.3561 1.0942 2.1317 1.0822 1.0911 1.0856 2.0696 1.1865 2.2925 1.0869 7.8347 6.1409 6.2171 6.1182 1.0696 1.0709 1.0692 1.0821 1.0695 1.0550 1.0613 1.1021 1.0952 1.0883 1.0998 1.0907 1.0962 1.0884 1.0858 1.0893 1.0910 1.0960 1.0896 1.1014 1.0955 1.0955
irintensity: 1.1154 0.0160 0.1734 0.0078 0.9442 0.0818 0.6054 0.6925 0.4617 2.7050 0.8209 2.1505 4.2027 0.6295 1.6223 5.5893 2.2259 1.5565 1.3104 1.7189 6.0840 3.4749 5.2205 0.2026 15.7125 4.9348 2.2167 14.7438 10.9349 17.2250 5.1663 2.8235 3.2036 12.3645 10.8364 60.4116 6.3722 51.3914 28.9758 42.5434 5.5086 19.9858 0.3983 9.3972 0.1612 17.6964 18.8556 7.8170 12.1701 9.8084 25.9921 1.1717 0.1062 1.0228 1.1396 6.6099 146.9062 41.0192 64.9618 81.2811 63.1845 59.7338 5.2676 35.4109 8.4959 9.4827 11.6357 19.7591 13.5432 0.7004 1.6804 17.4308 15.8741 7.7222 5.2060 36.6657 5.1084 8.3533 9.9702 2.3549 18.0217 19.6139 7.8222 13.5919 5.7525 0.8040 2.6399 3.5822 2.5207 2.4276 12.4513 0.9958 7.7725 2.2401 10.8494 12.8736 1.2593 9.8242 3.6908 98.2253 6.8949 12.7740 6.9593 3.9338 0.4683 5.4229 1.0062 121.6493 96.2985 67.2017 33.3118 90.3923 53.5013 37.4360 18.0599 32.3779 43.1112 44.2060 27.3328 38.0679 8.5873 0.0932 6.8740 12.5525 30.8611 1.8278 23.7072 4.5282 2.6525
temp: 298.150 k
press: 1.00000 atm
elementType: 17 8 8 7 6 6 6 6 6 6 6 6 6 6 6 6 6 6 6 6 6 6 6 1 1 1 1 1 1 1 1 1 1 1 1 1 1 1 1 1 1 1 1 1 1
symmnumber: 1
zpe: 965669.3 jmol-1
zpe.correction: 0.367804 hartree
zpe.thermalcorrener: 0.388439 hartree
zpe.thermalcorrenthalpy: 0.389383 hartree
zpe.thermalcorrgfe: 0.314495 hartree
zpe.sumelectzpe: -1400.734307 hartree
zpe.sumelectthermal: -1400.713672 hartree
zpe.sumelectthermalent: -1400.712727 hartree
zpe.sumelectthermalfe: -1400.787615 hartree
dipole: 2.3466 3.3803 0.9978
dipole: 4.2342
quadrupole: -161.3173 -136.2273 -140.2763
quadrupole: 1.7526 11.5158 -5.1807
quadrupole: -15.3770 9.7130 5.6640 1.7526 11.5158 -5.1807
hfenergy: -1401.1021107 hartree
pointgroup: C01 [X(C19H22Cl1N1O2)]
dipole: -0.8660701 1.4017539 -0.245177 debye
polarizability: 262.3938041|-25.353599|241.9723913|-13.2390658|19.0741336|165.9186068 unknown
InChI: InChI=1S/C19H22ClNO2/c20-18-9-7-17(8-10-18)19(16-5-2-1-3-6-16)23-14-12-21-11-4-13-22-15-21/h1-3,5-10,19H,4,11-15H2
charge 0 multiplicity 1
45 atoms
Cl 6.467665 -2.603236 -0.769816
O  -5.853837 -2.047788 0.570431
O  0.009947 -0.67373 -0.067324
N  -3.707108 -1.021565 0.07796
C  -4.35541 0.183543 -0.49938
C  -2.312129 -1.240312 -0.367113
C  -5.732838 0.394902 0.164851
C  -4.57183 -2.204875 -0.106287
C  -6.578695 -0.884064 0.023182
C  -1.33618 -0.374325 0.443258
C  1.078938 0.061211 0.638875
C  2.407955 -0.589211 0.244077
C  1.014957 1.560264 0.339582
C  3.630754 0.049501 0.570515
C  2.442228 -1.849983 -0.39822
C  0.77301 2.49453 1.374411
C  1.168799 2.026421 -0.991077
C  4.869976 -0.556532 0.269605
C  3.674233 -2.466957 -0.714748
C  0.695092 3.878747 1.091131
C  1.086107 3.404928 -1.278016
C  4.869925 -1.810471 -0.371169
C  0.851739 4.336315 -0.236474
H  -4.489173 0.07243 -1.608985
H  -3.710645 1.063302 -0.332144
H  -2.167642 -1.030732 -1.453803
H  -2.04558 -2.301561 -0.20481
H  -5.58678 0.619344 1.236338
H  -6.256665 1.24884 -0.306893
H  -4.771346 -2.401134 -1.197808
H  -4.094519 -3.086411 0.350361
H  -7.517969 -0.830485 0.596086
H  -6.816063 -1.070404 -1.049709
H  -1.407714 -0.633172 1.520485
H  -1.560293 0.705612 0.325183
H  0.930972 -0.076519 1.736302
H  3.621736 1.032795 1.054286
H  1.498839 -2.338265 -0.653905
H  0.645337 2.139535 2.405457
H  1.349706 1.301034 -1.79236
H  5.812152 -0.062602 0.523701
H  3.700494 -3.438819 -1.216176
H  0.510701 4.593889 1.900598
H  1.206714 3.757127 -2.308721
H  0.791939 5.407482 -0.459737
