program: Gaussian 09
title: 000102688
version: EM64L-G09RevD.01
frameworkgroup: C1[X(C11H15NO2)]
method: RPBEPBE
basis: SDD
operation: Freq
keyword: #p
keyword: freq=noraman
keyword: PBEPBE/SDD
title: #p freq=noraman PBEPBE/SDD
converged: YES YES NO NO
title: Mulliken charges:
elementType: O O N C C C C C C C C C C C H H H H H H H H H H H H H H H
charge: -0.279946 -0.245605 -0.619866 -0.590971 -0.180854 0.468123 0.300880 -0.390157 -0.415969 -0.235377 -0.228481 -0.241502 -0.224358 -0.673615 0.253845 0.195168 0.241212 0.270954 0.225688 0.291541 0.276445 0.224116 0.221895 0.230840 0.228517 0.225882 0.213270 0.227098 0.231229
chargesum: 0.00000
title: Mulliken charges with hydrogens summed into heavy atoms:
elementType: O O N C C C C C C C C C C C
charge: -0.279946 -0.245605 -0.051881 -0.141957 0.060358 0.468123 0.300880 -0.119203 -0.190281 -0.011261 -0.006586 -0.015620 0.234999 -0.002019
polarizability: 1.47779389e+02 -1.20188612e+01 1.27894561e+02 -1.12662328e+01 -1.02896147e+01 1.04899570e+02
1716.lowfreq: -11.0826 -0.0007 -0.0006 0.0002 2.2846 8.4474 19.9076 28.9922 54.7451
frequency: 19.8123 28.8254 54.6983 75.8831 90.1016 114.8392 128.3863 198.4124 236.5506 249.7038 274.1236 283.8648 345.0654 348.7070 350.7706 404.2396 431.7600 523.9107 571.9706 593.6723 614.9886 617.8055 705.6300 740.2502 756.8181 798.3274 800.7958 822.3995 855.4633 857.9430 922.8038 945.3299 977.7734 988.8692 991.1150 997.0714 1024.8994 1027.7868 1074.7192 1098.6868 1110.8368 1124.0404 1136.3356 1161.4708 1171.2381 1189.6062 1208.3289 1216.7631 1249.4002 1287.3397 1330.1298 1334.0441 1352.4001 1375.2857 1384.9539 1400.7080 1440.5751 1459.0672 1464.0003 1474.4142 1483.9203 1486.4572 1591.9278 1614.1536 1623.4557 1648.5817 2896.6960 2989.7094 2995.1202 3011.2901 3069.6625 3072.1106 3091.7049 3106.7576 3108.7919 3123.2126 3136.6425 3151.1576 3163.2629 3462.7254 3597.1237
redmass: 4.0743 3.8349 2.5369 5.8074 4.0521 2.7036 2.9521 4.3282 1.2276 1.3596 4.5965 2.6051 2.6368 4.1041 2.7722 2.8440 3.5533 3.0516 1.7610 3.7638 3.2254 5.6772 1.8136 4.9199 1.8468 1.8208 1.5923 3.8001 1.4907 2.4420 1.4792 2.1076 1.3996 2.5658 3.8391 1.4729 2.3879 2.2110 1.8588 2.3371 2.5286 3.6400 1.4820 1.1510 1.0537 1.1298 1.4693 2.3173 1.1343 1.2474 1.2800 1.4344 1.3447 2.4719 3.3577 1.2740 2.1562 1.1129 1.0403 1.0615 2.2643 1.0727 5.9512 6.0761 1.0988 10.7103 1.0813 1.0647 1.0358 1.0583 1.1065 1.0972 1.0985 1.1028 1.0873 1.0864 1.0923 1.0957 1.1007 1.0444 1.0987
irintensity: 0.3643 0.3000 0.0820 2.6591 3.5776 4.0294 7.3406 0.7966 12.8994 26.9828 3.3325 27.8645 0.2408 9.1652 3.7812 0.2324 0.9270 25.9568 147.2055 4.2785 71.0474 16.7718 59.2161 9.1129 48.2835 4.9374 4.0587 3.9343 4.2506 5.2450 2.5936 5.8908 1.0119 1.4822 1.0489 2.6087 54.7699 11.8678 13.4464 41.2678 84.4688 351.8671 12.6006 2.8959 0.1704 0.0007 1.0601 0.6779 0.0129 3.9264 0.8672 11.0968 4.7362 7.0425 3.4624 18.7193 9.0155 16.9698 12.1149 4.6060 20.5703 11.3400 0.7952 6.3349 49.0010 160.4301 58.6077 36.9083 21.2869 17.1510 6.2193 8.9294 29.4474 44.2734 11.7220 1.1939 31.2140 26.8302 16.6797 1.5121 2.2152
temp: 298.150 k
press: 1.00000 atm
elementType: 8 8 7 6 6 6 6 6 6 6 6 6 6 6 1 1 1 1 1 1 1 1 1 1 1 1 1 1 1
symmnumber: 1
zpe: 629476.0 jmol-1
zpe.correction: 0.239755 hartree
zpe.thermalcorrener: 0.254393 hartree
zpe.thermalcorrenthalpy: 0.255338 hartree
zpe.thermalcorrgfe: 0.196036 hartree
zpe.sumelectzpe: -632.305950 hartree
zpe.sumelectthermal: -632.291311 hartree
zpe.sumelectthermalent: -632.290367 hartree
zpe.sumelectthermalfe: -632.349669 hartree
dipole: -1.4829 0.4378 -2.4238
dipole: 2.8750
quadrupole: -73.4060 -74.2658 -87.0695
quadrupole: 1.8982 0.1162 -3.8922
quadrupole: 4.8411 3.9813 -8.8224 1.8982 0.1162 -3.8922
hfenergy: -632.5457047 hartree
pointgroup: C01 [X(C11H15N1O2)]
dipole: -0.3084427 -0.3274203 -1.0378156 debye
polarizability: 152.9556972|4.4583288|114.8851727|6.965499|-16.0423244|112.7326498 unknown
InChI: InChI=1S/C11H15NO2/c1-2-14-11(13)10(12)8-9-6-4-3-5-7-9/h3-7,10H,2,8,12H2,1H3
charge 0 multiplicity 1
29 atoms
O  -1.989312 -1.362213 -0.739901
O  -1.223969 -0.697174 1.356579
N  -2.17767 1.47514 -1.02879
C  -0.044842 1.715172 0.226089
C  -0.927152 0.781073 -0.643486
C  1.394401 1.233996 0.364258
C  -1.358908 -0.472604 0.134641
C  1.788659 0.393802 1.438014
C  2.370301 1.609232 -0.596132
C  3.123698 -0.057142 1.547133
C  3.705519 1.158107 -0.491394
C  4.087027 0.321876 0.583492
C  -2.537227 -2.614487 -0.12882
C  -3.130656 -3.438815 -1.266187
H  -0.527863 1.821908 1.21265
H  -0.050452 2.711951 -0.25825
H  -0.325425 0.435689 -1.517592
H  1.038984 0.089493 2.176157
H  2.083355 2.268457 -1.426016
H  -2.800339 0.90945 -1.61321
H  -2.02959 2.420527 -1.393542
H  3.412116 -0.702977 2.384525
H  4.446338 1.461972 -1.240031
H  -1.710607 -3.134994 0.387384
H  -3.289718 -2.327624 0.627866
H  5.122586 -0.026353 0.670582
H  -3.544569 -4.382837 -0.867219
H  -3.944391 -2.890483 -1.771238
H  -2.359895 -3.687143 -2.01566
