program: Gaussian 09
title: 000102687
version: EM64L-G09RevD.01
frameworkgroup: C1[X(C8H15O7PS)]
method: RPBEPBE
basis: SDD
operation: Freq
keyword: #p
keyword: freq=noraman
keyword: PBEPBE/SDD
title: #p freq=noraman PBEPBE/SDD
converged: YES YES NO NO
title: Mulliken charges:
elementType: S P O O O O O O O C C C C C C C C H H H H H H H H H H H H H H H
charge: 0.071224 1.067529 -0.493599 -0.480194 -0.276910 -0.263933 -0.602734 -0.233157 -0.236542 -0.608117 -0.482766 0.391334 0.278089 -0.484689 -0.501481 -0.500591 -0.505718 0.360623 0.279008 0.280232 0.245683 0.244070 0.238553 0.225455 0.292327 0.240382 0.233867 0.250031 0.246507 0.246398 0.242310 0.236809
chargesum: 0.00000
title: Mulliken charges with hydrogens summed into heavy atoms:
elementType: S P O O O O O O O C C C C C C C C
charge: 0.071224 1.067529 -0.493599 -0.480194 -0.276910 -0.263933 -0.602734 -0.233157 -0.236542 -0.247494 0.076473 0.391334 0.278089 0.243617 0.256683 0.229814 0.219800
polarizability: 2.07348082e+02 4.01985414e-01 1.40113066e+02 -5.11030362e+00 -3.24470755e+00 1.28203712e+02
1716.lowfreq: -16.5484 -7.0628 -0.0009 0.0009 0.0017 3.6383 18.4350 24.7290 29.5166
frequency: 14.0320 24.5803 29.4245 42.2343 51.0744 55.5774 65.7790 78.5709 94.0135 98.9581 101.7041 114.2744 118.2069 138.3346 155.5102 158.7718 164.8817 187.9115 217.6480 239.3598 249.9147 279.4728 294.6793 311.4239 320.9086 343.1049 352.2166 375.0055 474.7340 506.5754 544.1410 571.8838 611.0403 647.1717 658.7391 669.0067 754.1298 798.4135 864.3948 924.6804 942.0224 953.0247 956.2401 997.3191 1025.4585 1072.8636 1108.7537 1113.7770 1114.5482 1119.9628 1126.9782 1129.3877 1145.1358 1150.2148 1152.5189 1167.0498 1216.8002 1253.1965 1282.8781 1360.4280 1417.2757 1423.1161 1423.2755 1425.3244 1427.6856 1452.9677 1453.8221 1456.9836 1458.0066 1462.3685 1463.4781 1471.6153 1473.9454 1641.1572 1645.6046 2953.0846 2987.0842 2987.8926 3007.0364 3008.4940 3025.6072 3083.5926 3091.0503 3098.8571 3110.0567 3113.8944 3130.2868 3131.7924 3152.9538 3153.3105
redmass: 5.6324 4.8888 6.4750 3.2560 4.7038 4.3153 4.9216 2.9683 1.1622 3.4303 1.2420 1.1338 4.6496 4.5414 2.4085 1.3617 4.4834 4.8639 5.3973 5.4228 4.7879 4.3825 7.3051 4.3398 6.6218 7.1594 7.0947 6.3912 9.3165 7.3499 2.9382 4.6690 10.8746 6.3285 10.8355 4.8767 6.2588 5.4750 5.7908 3.7551 6.5238 11.6585 11.1700 3.6891 15.1383 2.3947 1.2446 1.2666 1.2645 1.2370 1.2852 1.2822 3.0053 1.4653 1.7170 2.5961 1.2070 1.3086 1.7003 1.5979 1.1078 1.1435 1.1463 1.1808 1.1190 1.0498 1.0498 1.0474 1.0496 1.0507 1.0505 1.0534 1.0558 9.2878 10.2921 1.0836 1.0296 1.0296 1.0296 1.0291 1.0607 1.1000 1.1057 1.1043 1.1048 1.1050 1.1048 1.1034 1.1053 1.1050
irintensity: 0.1768 1.4680 0.3757 5.5854 3.1986 3.0418 1.6989 8.4639 0.6621 0.4350 0.2453 0.7238 2.5106 1.4507 10.8795 3.7699 3.3367 3.7353 21.3681 4.6901 21.1079 14.9244 19.0833 22.3976 18.3764 6.8422 5.1347 6.5226 43.8323 35.4352 4.5868 18.9511 170.6973 7.1512 118.0912 1.5097 8.3222 14.4117 2.4216 9.7070 30.0487 131.8180 247.6528 91.7500 89.8768 22.6202 0.3537 0.0428 0.2075 2.4195 0.9534 0.5003 191.4040 10.3107 92.1187 344.8863 28.5820 12.4746 15.8734 55.2830 16.3416 24.0209 20.5849 18.7242 5.9784 14.2203 16.2000 5.1370 12.3779 11.9723 14.8360 24.8047 10.3389 49.0107 269.0571 37.9829 40.2416 61.6171 32.7707 30.2201 3.9853 1.2459 25.9080 10.7892 24.1588 19.2794 7.3873 11.7597 13.0321 17.4383
temp: 298.150 k
press: 1.00000 atm
elementType: 16 15 8 8 8 8 8 8 8 6 6 6 6 6 6 6 6 1 1 1 1 1 1 1 1 1 1 1 1 1 1 1
symmnumber: 1
zpe: 617408.6 jmol-1
zpe.correction: 0.235159 hartree
zpe.thermalcorrener: 0.258009 hartree
zpe.thermalcorrenthalpy: 0.258953 hartree
zpe.thermalcorrgfe: 0.178564 hartree
zpe.sumelectzpe: -1578.312340 hartree
zpe.sumelectthermal: -1578.289490 hartree
zpe.sumelectthermalent: -1578.288546 hartree
zpe.sumelectthermalfe: -1578.368935 hartree
dipole: -2.5192 -0.2142 -0.8686
dipole: 2.6733
quadrupole: -85.4295 -106.1624 -120.5474
quadrupole: -5.6731 -8.2077 -0.4538
quadrupole: 18.6169 -2.1159 -16.5010 -5.6731 -8.2077 -0.4538
hfenergy: -1578.5474988 hartree
pointgroup: C01 [X(C8H15O7P1S1)]
dipole: -0.7868729 -0.6363364 -0.2865403 debye
polarizability: 192.4692709|28.6195321|151.7878945|-2.2840621|-8.1897335|131.4076945 unknown
InChI: InChI=1S/C6H9O4S.C2H6O3P/c1-9-5(7)3-4(11)6(8)10-2;1-4-6(3)5-2/h4H,3H2,1-2H3;1-2H3
charge 0 multiplicity 1
32 atoms
S  1.224012 -0.864873 -0.287834
P  2.587894 0.801913 0.502157
O  4.08665 -0.06044 0.352942
O  2.730852 2.08435 -0.652657
O  -2.519811 0.509654 0.254375
O  -2.164157 -3.517438 1.062084
O  2.196655 1.37042 1.937397
O  -0.82565 1.332026 -1.108124
O  -1.505343 -2.36958 -0.854032
C  -0.292043 -0.273543 0.709557
C  -0.979677 -1.465626 1.389913
C  -1.19777 0.58828 -0.176833
C  -1.55553 -2.460234 0.39396
C  5.327144 0.625254 0.79771
C  2.406824 1.84021 -2.082105
C  -3.487647 1.348802 -0.495972
C  -2.767583 -4.563726 0.19843
H  0.122368 0.389077 1.500159
H  -0.262237 -1.988653 2.046779
H  -1.803609 -1.102514 2.029911
H  5.275877 0.85824 1.875771
H  6.128081 -0.102737 0.602203
H  5.495741 1.547867 0.213761
H  3.051144 1.048772 -2.50631
H  1.341013 1.576098 -2.182843
H  2.617685 2.80287 -2.571708
H  -4.449878 1.186227 0.008786
H  -3.526862 1.02152 -1.547974
H  -3.185185 2.408209 -0.452105
H  -1.998136 -5.007922 -0.454714
H  -3.565741 -4.127256 -0.424974
H  -3.171778 -5.306047 0.900089
