program: Gaussian 09
title: 000102684
version: EM64L-G09RevD.01
frameworkgroup: C1[X(C10H16O)]
method: RPBEPBE
basis: SDD
operation: Freq
keyword: #pfreq=noraman
keyword: PBEPBE/SDD
title: #p freq=noraman PBEPBE/SDD
converged: YES YES NO NO
title: Mulliken charges:
elementType: O C C C C C C C C C C H H H H H H H H H H H H H H H H
charge: -0.191324 -0.231887 -0.055536 -0.141958 -0.469881 -0.497994 -0.750081 0.468075 -0.126214 -0.827861 -0.729314 0.256039 0.226411 0.219334 0.222702 0.203483 0.238514 0.199529 0.213354 0.231259 0.218110 0.179075 0.259311 0.219949 0.226886 0.218728 0.221295
chargesum: 0.00000
title: Mulliken charges with hydrogens summed into heavy atoms:
elementType: O C C C C C C C C C C
charge: -0.191324 0.024152 0.170875 0.077375 -0.043696 -0.059952 -0.087358 0.468075 0.052861 -0.121716 -0.289291
polarizability: 1.18249040e+02 1.81502855e-01 1.06953517e+02 -7.53376126e+00 8.06633316e+00 9.21892665e+01
1716.lowfreq: -17.9676 -0.0007 -0.0007 -0.0001 6.3820 14.8744 35.9354 57.5715 77.8651
frequency: 35.3608 57.5141 77.8372 154.1562 167.2164 191.4385 204.5947 232.8680 278.5666 292.7577 327.0076 384.2382 424.3981 453.8805 471.4823 526.8890 542.9013 605.1093 720.4731 804.8202 831.7200 848.8013 900.0365 916.7118 935.6895 953.1012 975.1614 984.2173 1000.6924 1007.0248 1019.0018 1040.2016 1065.6001 1078.5731 1110.2405 1143.6383 1170.2992 1191.5160 1235.5337 1242.8435 1256.1952 1277.8738 1286.7063 1292.1825 1321.3947 1332.3879 1347.5480 1388.3224 1391.7793 1399.5879 1426.9165 1465.6970 1469.3003 1473.3578 1474.9365 1477.3963 1480.1366 1634.7407 1665.9290 2862.9164 2940.8056 2947.4875 2964.9442 2972.0364 2983.5289 2987.7302 3036.9451 3040.1169 3054.7130 3065.2667 3068.7346 3073.9553 3086.5522 3097.4866 3196.7507
redmass: 3.2902 5.9190 3.4483 3.0135 2.1300 1.1436 2.4552 1.1090 2.2406 2.4471 3.0019 2.5942 4.2522 2.6399 2.6743 2.7413 2.3511 2.0402 1.2803 2.3189 2.4883 2.0594 2.2686 1.8687 1.3271 1.4323 1.7811 1.6276 1.8068 1.4176 1.6543 1.9083 1.9965 2.0125 3.4303 2.3938 1.4498 1.5786 1.4485 1.3049 1.5501 1.3205 1.3601 1.3483 1.3969 1.4558 1.9356 1.2084 1.2072 1.2102 1.1896 1.0479 1.0758 1.0741 1.0521 1.0672 1.0674 7.7186 4.9133 1.0841 1.0820 1.0836 1.0380 1.0361 1.0636 1.0625 1.0877 1.0959 1.0990 1.1012 1.1006 1.0996 1.0982 1.0626 1.1135
irintensity: 0.5684 3.6512 2.7358 0.3242 0.8916 0.1660 1.6574 0.4220 1.3313 2.0384 1.6109 6.9911 2.4515 9.2751 2.4938 0.8367 2.2525 2.0200 0.2200 2.0858 0.3978 0.3172 0.4446 1.3569 74.5320 2.5349 8.2832 6.0256 17.0928 2.5358 1.1480 17.8965 7.4133 1.2263 4.0728 6.3921 2.5313 5.1734 2.6522 1.9194 3.5267 0.1436 11.1220 0.4697 2.0573 5.8045 1.8576 10.2648 1.9435 26.6896 1.5805 16.9372 9.1886 11.8616 7.8161 10.4976 11.7183 164.8060 26.8284 67.4457 14.9098 18.1178 25.7181 27.7266 42.4669 28.8721 21.2970 14.5082 25.3331 12.2057 82.2696 34.4258 27.7999 7.1598 22.8617
temp: 298.150 k
press: 1.00000 atm
elementType: 8 6 6 6 6 6 6 6 6 6 6 1 1 1 1 1 1 1 1 1 1 1 1 1 1 1 1
symmnumber: 1
zpe: 615158.5 jmol-1
zpe.correction: 0.234302 hartree
zpe.thermalcorrener: 0.246467 hartree
zpe.thermalcorrenthalpy: 0.247411 hartree
zpe.thermalcorrgfe: 0.195854 hartree
zpe.sumelectzpe: -464.984983 hartree
zpe.sumelectthermal: -464.972817 hartree
zpe.sumelectthermalent: -464.971873 hartree
zpe.sumelectthermalfe: -465.023430 hartree
dipole: -1.2196 -3.0422 0.6482
dipole: 3.3410
quadrupole: -65.6176 -79.6098 -65.9020
quadrupole: -0.1403 1.1499 3.1674
quadrupole: 4.7588 -9.2334 4.4745 -0.1403 1.1499 3.1674
hfenergy: -465.2192842 hartree
pointgroup: C01 [X(C10H16O1)]
dipole: 0.4524481 1.2195235 0.1893158 debye
polarizability: 118.0338118|0.9822143|105.9839064|7.9841479|-8.7105728|93.3741049 unknown
InChI: InChI=1S/C10H16O/c1-7(2)9-5-4-8(3)10(9)6-11/h6,8-10H,1,4-5H2,2-3H3
charge 0 multiplicity 1
27 atoms
O  -0.160581 -2.717081 -0.509195
C  0.545927 -0.503558 0.303943
C  1.93582 0.093981 -0.15853
C  -0.427633 0.743652 0.426541
C  1.735334 1.638794 -0.169618
C  0.231297 1.822854 -0.466617
C  3.115848 -0.387552 0.707516
C  -1.904736 0.422347 0.201967
C  0.055522 -1.500416 -0.730626
C  -2.522822 -0.531088 1.213133
C  -2.636603 0.960484 -0.810172
H  0.641866 -1.032467 1.268926
H  2.12088 -0.22701 -1.206516
H  -0.327589 1.088141 1.479654
H  2.390019 2.137878 -0.906382
H  1.979239 2.05491 0.828461
H  -0.141583 2.837463 -0.240906
H  0.031121 1.621244 -1.537456
H  2.970796 -0.094567 1.764559
H  3.223091 -1.487057 0.671329
H  4.067442 0.057255 0.360859
H  -0.088302 -1.073675 -1.758019
H  -2.032733 -1.523475 1.185247
H  -2.403233 -0.142108 2.243859
H  -3.599645 -0.679928 1.025214
H  -3.697882 0.715698 -0.934808
H  -2.20966 1.66168 -1.535166
