program: Gaussian 09
title: 000102671
version: EM64L-G09RevD.01
frameworkgroup: C1[X(C5H7BrN2O2)]
method: RPBEPBE
basis: SDD
operation: Freq
keyword: #p
keyword: freq=noraman
keyword: PBEPBE/SDD
title: #p freq=noraman PBEPBE/SDD
converged: NO NO NO NO
title: Mulliken charges:
elementType: Br O O N N C C C C C H H H H H H H
charge: 0.027409 -0.203149 -0.250994 -0.328960 -0.378934 -0.232231 -0.375075 0.244698 -0.651295 0.186031 0.243449 0.264047 0.235622 0.224258 0.282534 0.349000 0.363589
chargesum: 0.00000
title: Mulliken charges with hydrogens summed into heavy atoms:
elementType: Br O O N N C C C C C
charge: 0.027409 -0.203149 -0.250994 0.020040 -0.015345 -0.232231 0.132421 0.244698 0.091120 0.186031
polarizability: 9.76308894e+01 -4.60216097e+00 8.90330141e+01 -1.58838274e+00 2.17834889e+00 7.62221165e+01
1716.lowfreq: -13.5385 -9.4547 0.0009 0.0011 0.0012 5.6850 64.6691 135.0895 143.2861
frequency: 64.6671 135.0888 143.2827 189.5237 216.3609 252.7403 276.2527 302.8748 363.7654 423.1197 459.9863 500.4308 540.2468 562.8861 671.0925 698.4642 716.7732 735.5319 773.5528 905.9045 922.6269 991.2386 1064.3322 1104.3799 1148.6704 1206.8699 1234.9186 1269.1048 1345.8513 1368.0906 1390.4693 1395.7851 1418.8080 1451.8059 1465.1616 1466.8760 1631.8103 1685.3528 2932.5791 2991.9633 3079.2407 3090.5868 3132.3311 3525.4870 3587.5888
redmass: 11.7242 12.6709 4.6131 9.2556 1.0654 2.5506 2.9115 2.9150 9.5784 4.8923 4.9681 8.0134 1.1840 4.4459 2.1945 5.8709 4.7811 5.0784 1.9791 2.1772 2.3054 1.7469 1.9973 2.1493 3.9865 2.7089 1.9102 1.8357 3.3692 1.7117 1.8570 1.2126 1.5866 1.0637 1.0536 1.1271 8.3231 5.4104 1.0699 1.0402 1.0919 1.0943 1.1004 1.0769 1.0782
irintensity: 0.3342 2.7952 0.4711 0.8657 0.0850 0.9229 4.3357 6.0390 19.5370 16.9354 29.7170 6.9003 80.5891 8.2506 31.8219 5.4311 6.7100 29.5726 125.2803 4.3985 1.1382 1.0703 55.2869 49.0413 34.3190 38.8436 83.9073 71.3594 113.7058 4.4327 70.6803 32.8093 25.5412 1.5166 15.1931 44.3086 230.5335 530.1718 36.4750 15.1386 4.8509 16.7769 3.2967 62.2860 57.5709
temp: 298.150 k
press: 1.00000 atm
elementType: 35 8 8 7 7 6 6 6 6 6 1 1 1 1 1 1 1
symmnumber: 1
zpe: 327983.0 jmol-1
zpe.correction: 0.124922 hartree
zpe.thermalcorrener: 0.134687 hartree
zpe.thermalcorrenthalpy: 0.135631 hartree
zpe.thermalcorrgfe: 0.089056 hartree
zpe.sumelectzpe: -467.421475 hartree
zpe.sumelectthermal: -467.411710 hartree
zpe.sumelectthermalent: -467.410765 hartree
zpe.sumelectthermalfe: -467.457341 hartree
dipole: -1.1743 -0.1935 4.6953
dipole: 4.8438
quadrupole: -78.7790 -71.7054 -61.9525
quadrupole: 4.1004 0.7276 0.2806
quadrupole: -7.9667 -0.8931 8.8598 4.1004 0.7276 0.2806
hfenergy: -467.5463969 hartree
pointgroup: C01 [X(C5H7Br1N2O2)]
dipole: 0.5497902 1.3950526 1.1760912 debye
dipolederiv: -0.1500512 -0.0233042 0.0313448 -0.0526519 -0.1975771 0.1477258 0.0643531 0.0960368 -0.5863863 -0.823925 0.1971809 -0.0178084 0.3868092 -0.8805706 0.0956647 -0.0257971 -0.0066929 -0.2938508 -1.3038629 -0.1515672 -0.1009482 -0.0751492 -0.586101 -0.0615276 -0.1827205 -0.0885341 -0.4084962 -0.6712476 -0.232463 -0.0262293 -0.3239181 -0.8552264 -0.1689425 -0.0051612 -0.0849254 -0.4495422 -1.4502207 0.4737614 0.0753843 0.2295505 -0.5892768 0.0355849 -0.0217167 0.0572734 -0.3268626 0.1300521 -0.0828935 -0.0049814 -0.0468449 -0.0674104 -0.0674277 -0.0873536 -0.1288212 0.9251912 0.4408416 0.1566723 0.0768364 0.0078277 0.0716617 0.0227615 0.1444113 -0.0299578 0.1374537 1.5805329 -0.2922704 -0.118719 -0.0567639 1.0040943 -0.2652386 0.0448506 -0.0547032 0.0664683 -0.1122411 0.0232063 0.0107319 0.0330924 0.0162107 0.0244069 -0.05264 0.0121208 -0.1223135 1.8677307 0.0446755 0.145439 -0.1002166 1.5411902 0.2582886 0.2573374 0.2082612 0.37816 -0.0364475 -0.0419076 0.004773 0.040481 0.0994538 0.0245402 -0.0689365 -0.0105445 -0.1608885 0.0493078 -0.0467215 -0.0182584 -0.0597796 -0.0662699 -0.0026131 -0.024372 0.0396463 0.1129032 0.0656151 -0.0427447 -0.0208194 -0.0997914 -0.0790542 0.0016802 -0.0037377 0.0210491 0.1074844 0.0666265 -0.0053015 0.0079782 -0.0085122 0.1020599 0.0391667 0.0071063 0.0459709 -0.1245408 0.0594618 0.0372541 0.0213 0.0978168 0.0636389 -0.0507098 0.047338 -0.0438442 0.0849281 0.140183 -0.0316686 -0.0522734 -0.0338691 0.212029 -0.0167886 -0.0548427 -0.0226045 0.322486 0.1476445 0.0180917 -0.0137501 0.0619193 0.211148 -0.0165716 -0.0381187 -0.0097305 0.3378059 unknown
polarizability: 99.8453821|-0.0234318|80.705808|0.468793|-5.6295066|82.3348299 unknown
InChI: InChI=1S/C5H7BrN2O2/c1-5(6)2-7-4(10)8-3(5)9/h7-8H,2H2,1H3
charge 0 multiplicity 1
17 atoms
Br 1.282889 0.963161 -1.874741
O  1.274822 -2.039912 0.09984
O  -3.005586 -0.237252 -0.278847
N  -1.251329 1.212694 0.278648
N  -0.850209 -1.096662 0.045605
C  1.107586 0.425022 0.123039
C  0.111725 1.395691 0.782802
C  0.546716 -1.013928 0.086165
C  2.501322 0.474963 0.746718
C  -1.795584 -0.024834 0.000087
H  0.156523 1.212559 1.880251
H  0.431806 2.434544 0.601533
H  2.936919 1.483673 0.657323
H  2.4390 0.202035 1.818032
H  3.162017 -0.25442 0.254777
H  -1.886684 2.006746 0.206431
H  -1.256132 -2.030981 -0.069261
