program: Gaussian 09
title: 000102675
version: EM64L-G09RevD.01
frameworkgroup: C1[X(C21H15N5O11)]
method: RPBEPBE
basis: SDD
operation: Freq
keyword: #p
keyword: freq=noraman
keyword: PBEPBE/SDD
title: #p freq=noraman PBEPBE/SDD
converged: YES YES NO NO
title: Mulliken charges:
elementType: O O O O O O O O O O O N N N N N C C C C C C C C C C C C C C C C C C C C C H H H H H H H H H H H H H H H
charge: -0.256277 -0.413425 -0.181678 -0.283087 -0.190352 -0.205372 -0.197786 -0.168677 -0.188310 -0.196602 -0.199369 -0.407494 0.029461 0.018230 0.009628 0.021193 -0.134417 -0.636115 0.487228 0.336702 0.141695 -0.400549 -0.351956 0.250381 0.341126 -0.347421 -0.378701 -0.257238 -0.497546 -0.424066 0.450285 0.216773 0.289193 -0.284297 -0.479218 0.426577 -0.397093 0.281330 0.252924 0.251024 0.380198 0.250596 0.238695 0.275841 0.267054 0.267205 0.338443 0.295600 0.393593 0.323274 0.330805 0.311994
chargesum: 0.00000
title: Mulliken charges with hydrogens summed into heavy atoms:
elementType: O O O O O O O O O O O N N N N N C C C C C C C C C C C C C C C C C C C C C
charge: -0.256277 -0.019832 -0.181678 -0.283087 -0.190352 -0.205372 -0.197786 -0.168677 -0.188310 -0.196602 -0.199369 -0.027297 0.029461 0.018230 0.009628 0.021193 0.146913 -0.132167 0.487228 0.336702 0.141695 -0.149953 -0.113261 0.250381 0.341126 -0.071580 -0.111647 0.009967 -0.159104 -0.128467 0.450285 0.216773 0.289193 0.038977 -0.148413 0.426577 -0.085099
polarizability: 4.47145325e+02 -2.53756149e+01 3.95807016e+02 1.84343677e+01 -1.19719447e+01 1.97691356e+02
1716.lowfreq: -1.9624 0.0007 0.0009 0.0010 1.9827 6.0224 10.7667 12.9787 23.6405
frequency: 10.1355 12.8604 23.6373 26.1150 33.6149 38.5565 44.0385 46.4634 52.4317 56.5705 58.1616 69.3768 81.1346 88.6038 102.3787 113.1090 127.2046 141.9103 154.7688 165.7467 170.5899 172.4417 196.3400 241.1845 263.3335 270.6514 278.2991 301.4375 316.2588 323.8638 330.7365 335.8352 352.1833 373.3604 396.1031 408.4481 417.6461 421.4961 439.8718 444.2596 480.8070 494.2416 502.0780 510.0855 515.7690 517.8965 562.3727 592.9358 598.5781 614.8427 624.3682 627.4674 641.8573 646.5686 653.4713 662.6213 670.4976 674.4636 691.1176 706.5738 712.7256 716.9018 730.0590 734.9893 751.6835 754.4862 758.6267 778.7560 790.3502 800.9569 831.0177 835.1827 836.8185 840.8412 869.4699 877.1237 888.0540 899.0779 939.7758 949.7435 958.3953 965.6123 971.3211 995.8433 1002.6607 1010.6077 1011.3248 1025.3114 1051.5640 1051.6698 1105.8833 1106.4393 1112.1695 1119.9123 1149.5387 1152.2101 1157.9975 1175.2996 1191.4679 1201.3190 1205.7454 1213.2480 1218.0277 1219.3344 1233.3462 1237.7249 1255.1491 1262.7023 1289.5265 1299.9878 1308.5230 1328.1626 1342.7555 1349.2809 1359.5218 1366.9764 1375.0025 1381.9896 1385.3040 1402.0018 1414.1241 1426.5053 1450.8724 1466.1306 1474.1766 1485.2718 1493.1463 1523.2297 1581.0475 1584.8377 1595.4513 1601.0682 1617.9012 1627.8930 1676.5336 3002.1953 3012.6275 3073.1034 3129.9411 3134.7314 3152.5922 3165.5807 3167.8067 3174.5597 3183.3579 3185.8880 3187.3323 3188.8488 3305.3148 3513.2258
redmass: 11.1725 11.9024 10.1021 9.9518 10.3233 11.3136 12.3404 5.5138 8.7415 12.4045 10.7494 5.5693 8.7910 8.7185 8.2883 7.6322 8.7064 10.2484 5.9454 7.6845 6.2863 8.8015 8.2630 8.0696 6.3340 6.7235 7.2188 6.8594 6.7543 7.1734 4.8663 6.0759 7.9586 9.2823 6.3984 3.7851 3.8841 5.1921 4.8422 4.4865 4.9512 4.8441 7.1951 5.7268 4.2406 4.0485 4.2729 4.7214 2.6877 2.7962 4.4521 6.3106 6.2972 6.6544 6.7425 4.3069 6.4998 7.5891 4.6296 7.6137 6.5031 4.3905 3.0330 5.3311 6.0562 11.9867 8.4673 1.4837 3.6842 3.5569 2.0595 1.3852 1.4907 5.7351 2.5243 1.6030 7.8416 5.1456 2.1177 1.4739 1.4047 1.4244 1.3794 1.3998 2.9762 2.5193 1.4051 3.1067 2.2578 2.2677 2.7778 2.1446 4.5042 1.8215 1.3325 1.4639 2.0297 5.9798 1.4524 1.6874 7.5902 3.0898 5.8515 4.7573 1.4203 3.9038 1.6308 1.5890 1.5204 1.2986 2.7807 1.5592 2.7232 1.5316 6.4597 5.1667 11.4684 5.4181 4.8092 8.5880 2.8598 6.1912 5.0116 2.6672 1.1272 2.4472 2.5329 3.8903 4.8606 8.4603 7.4725 6.7631 6.6593 7.2040 9.0185 1.0842 1.0603 1.1035 1.0903 1.0900 1.0920 1.0886 1.0958 1.0958 1.0952 1.0932 1.0957 1.0927 1.0790 1.0644
irintensity: 0.4328 0.6427 1.2560 1.3811 0.7066 0.2768 0.9338 0.5431 0.3116 0.4151 0.1421 0.1940 0.8016 3.0374 1.6342 2.5597 0.7109 3.2414 1.9356 0.9197 4.7006 3.1690 1.7654 2.2693 1.3546 0.2609 0.3141 1.4063 0.8242 0.2782 0.4475 0.7035 0.7120 0.7682 1.1021 1.7658 1.9457 5.9532 0.5179 2.3122 3.4803 34.4323 10.0186 20.8759 13.2304 7.8392 2.1078 28.1196 56.2567 46.3601 7.9572 14.5643 16.5592 7.3204 16.7438 49.8253 10.8564 10.8389 45.0133 10.8931 13.0373 2.0419 3.1120 9.9111 10.0727 13.7751 14.5923 90.0443 3.0219 13.7982 32.9189 14.0120 22.2797 9.8380 37.4534 16.9284 39.4839 4.2934 5.6295 25.3629 0.2816 24.5612 0.8612 1.3758 9.1610 37.5894 2.0966 390.0472 57.7301 4.4138 68.5633 29.5809 7.3009 13.5662 29.4298 93.7651 176.4269 406.8038 85.2888 144.0020 328.8861 104.8412 339.8587 182.2294 17.2060 252.5880 29.6006 4.9320 8.4067 0.3973 142.6984 34.9153 58.0186 57.3765 89.1981 65.9277 81.9343 48.8401 6.3319 47.2717 5.1752 31.1587 7.0487 185.1806 12.6237 10.1198 101.8312 139.4848 78.0333 30.5989 6.0871 211.5812 2.8743 362.2149 182.1772 11.7790 14.8668 6.0514 9.6234 10.0885 38.0467 1.9807 2.5370 1.2574 15.5111 9.2262 13.5041 16.7584 167.5319 52.1992
temp: 298.150 k
press: 1.00000 atm
elementType: 8 8 8 8 8 8 8 8 8 8 8 7 7 7 7 7 6 6 6 6 6 6 6 6 6 6 6 6 6 6 6 6 6 6 6 6 6 1 1 1 1 1 1 1 1 1 1 1 1 1 1 1
symmnumber: 1
zpe: 923113.7 jmol-1
zpe.correction: 0.351595 hartree
zpe.thermalcorrener: 0.384034 hartree
zpe.thermalcorrenthalpy: 0.384978 hartree
zpe.thermalcorrgfe: 0.281458 hartree
zpe.sumelectzpe: -1907.497162 hartree
zpe.sumelectthermal: -1907.464723 hartree
zpe.sumelectthermalent: -1907.463779 hartree
zpe.sumelectthermalfe: -1907.567300 hartree
dipole: 9.0372 -10.0606 0.3055
dipole: 13.5271
quadrupole: -259.2517 -245.1572 -213.1377
quadrupole: -33.3906 7.8130 3.6148
quadrupole: -20.0695 -5.9750 26.0445 -33.3906 7.8130 3.6148
hfenergy: -1907.8487573 hartree
pointgroup: C01 [X(C21H15N5O11)]
dipole: 3.2051024 -4.2448898 0.1772069 debye
polarizability: 438.7509283|-29.611252|401.2169063|34.2066636|-6.9328795|200.6758635 unknown
InChI: InChI=1S/C21H15N5O11/c27-21(28)17(22-16-7-3-13(23(29)30)10-18(16)25(33)34)9-12-1-5-15(6-2-12)37-20-8-4-14(24(31)32)11-19(20)26(35)36/h1-8,10-11,17,22,27H,9H2
charge 0 multiplicity 1
52 atoms
O  -3.382021 -1.560632 0.592449
O  5.006938 -3.901442 0.351263
O  4.695812 -2.645025 -1.588182
O  0.609055 0.301068 -0.898125
O  0.781946 2.541763 -0.552407
O  6.340341 3.246565 2.253505
O  4.667753 4.55223 1.402639
O  -6.05349 -2.039486 0.308146
O  -7.127607 -0.289955 1.307735
O  -3.939206 4.522125 -1.317179
O  -6.103613 4.038081 -0.77181
N  2.526449 -1.303388 -0.112677
N  1.27608 1.354615 -0.472362
N  5.20975 3.405916 1.645046
N  -6.140013 -0.802175 0.650382
N  -4.859307 3.718045 -0.901106
C  2.949386 -2.671053 0.19002
C  1.882981 -3.701334 -0.337399
C  0.454442 -3.238879 -0.090713
C  3.154393 -0.170143 0.326202
C  4.293324 -3.023068 -0.473416
C  -0.363891 -2.868392 -1.187805
C  -0.060331 -3.094772 1.224019
C  2.589222 1.153725 0.128587
C  -2.094586 -2.115897 0.33187
C  -1.645006 -2.314357 -0.987741
C  -1.334484 -2.532053 1.443709
C  4.408784 -0.231889 1.028785
C  3.266401 2.318012 0.553747
C  5.070414 0.915381 1.455587
C  4.498111 2.192114 1.202228
C  -3.701477 -0.287805 0.129052
C  -5.063395 0.126967 0.224427
C  -2.73131 0.640754 -0.331832
C  -5.443407 1.442171 -0.092101
C  -4.459181 2.336586 -0.549539
C  -3.104925 1.949419 -0.674928
H  3.069558 -2.80251 1.282655
H  2.094517 -4.664703 0.159906
H  2.040123 -3.844782 -1.42162
H  1.62183 -1.146197 -0.589418
H  0.006469 -2.998885 -2.21107
H  0.54203 -3.405164 2.0862
H  -2.272651 -2.027361 -1.836697
H  -1.73798 -2.400478 2.451676
H  4.862239 -1.20551 1.230898
H  2.820425 3.301663 0.384851
H  6.027459 0.859629 1.981073
H  5.843447 -4.19631 -0.101847
H  -1.679771 0.350715 -0.415876
H  -6.484109 1.759892 0.010867
H  -2.359315 2.669806 -1.022473
