program: Gaussian 09
title: 000102667
version: EM64L-G09RevD.01
frameworkgroup: C1[X(C10H16O)]
method: RPBEPBE
basis: SDD
operation: Freq
keyword: #pfreq=noraman
keyword: PBEPBE/SDD
title: #p freq=noraman PBEPBE/SDD
converged: YES YES NO NO
title: Mulliken charges:
elementType: O C C C C C C C C C C H H H H H H H H H H H H H H H H
charge: -0.450192 0.372311 -0.223870 -0.423208 -0.546691 -0.466837 0.641551 -0.278479 -0.778999 -0.766705 -0.816577 0.238564 0.242570 0.220083 0.272471 0.241444 0.210040 0.210503 0.235093 0.214107 0.211836 0.211576 0.228148 0.213660 0.222353 0.228797 0.336452
chargesum: 0.00000
title: Mulliken charges with hydrogens summed into heavy atoms:
elementType: O C C C C C C C C C C
charge: -0.113740 0.372311 0.014694 -0.180639 -0.054137 -0.015353 0.641551 -0.067976 -0.117963 -0.113321 -0.365427
polarizability: 1.14351037e+02 7.93204193e+00 1.11185965e+02 -6.48877519e-01 -1.54915442e+00 9.15210364e+01
1716.lowfreq: -23.1556 -7.2228 0.0002 0.0004 0.0005 11.6416 94.9383 137.6913 174.5609
frequency: 94.8895 137.6856 174.5595 200.3715 214.2032 241.1735 251.7760 327.8601 335.5024 368.9360 392.9288 412.6164 425.5778 454.2676 481.7800 594.4917 637.3319 678.3873 715.6969 767.2817 806.2511 824.6550 865.1876 874.5465 904.8884 931.5701 934.7803 940.7336 955.1656 976.2518 991.4746 1015.3113 1053.2230 1055.2319 1089.7433 1105.5072 1144.7836 1180.4627 1190.3808 1209.2650 1222.4448 1237.3352 1257.8493 1265.3906 1289.2782 1296.9094 1302.0712 1341.1885 1349.3917 1379.3964 1395.3371 1431.1011 1453.0684 1460.5463 1471.2682 1474.6551 1488.9242 1490.8468 1653.7863 2961.0222 2968.3288 2972.0615 3004.7144 3027.7648 3031.1772 3048.5641 3052.2636 3058.4808 3061.9149 3077.3229 3077.6834 3081.6414 3117.3349 3180.1566 3538.3527
redmass: 3.7597 2.4728 1.2631 2.2209 1.4483 3.0750 1.9556 1.9795 1.3025 2.3809 2.1931 2.6113 2.1378 2.8054 3.5884 3.6207 3.4958 4.0211 1.2399 2.7516 2.1478 2.4763 2.5382 2.6845 2.1772 1.4856 1.8396 1.5008 1.7829 2.0081 1.3994 1.7710 1.9373 1.5521 1.3537 1.5538 1.5830 1.1520 1.7842 1.5605 2.2069 1.6741 1.5726 1.6136 1.4550 2.2448 1.9666 1.4982 1.5443 1.2148 1.1990 1.2053 1.0710 1.0563 1.0541 1.0797 1.0580 1.0631 5.5571 1.0844 1.0369 1.0368 1.0633 1.0813 1.0829 1.0726 1.0989 1.0979 1.1017 1.0642 1.0960 1.0970 1.1074 1.1130 1.0657
irintensity: 1.3235 0.8642 0.0599 0.0758 1.6651 0.3758 7.3094 37.2778 94.9917 3.2229 0.3517 0.3068 7.7043 3.4254 2.7488 2.9421 8.4135 2.3326 1.7418 8.8636 3.4064 4.2068 16.3827 11.3690 4.2118 66.1972 19.3325 3.8599 3.6667 22.3432 2.9350 6.5479 4.3102 8.5413 5.8802 14.1184 3.0860 60.8060 4.3588 1.8312 6.3553 1.3634 2.9877 4.4609 20.5798 3.1663 1.4903 4.7578 7.3037 16.4227 16.2936 10.4890 10.9146 2.9847 6.3099 4.8579 15.1158 10.7163 26.9284 50.9495 18.9921 48.9171 35.1085 59.6597 33.4777 39.8878 0.6918 68.4067 20.3606 4.8312 42.5572 42.0044 18.3955 18.2294 3.0307
temp: 298.150 k
press: 1.00000 atm
elementType: 8 6 6 6 6 6 6 6 6 6 6 1 1 1 1 1 1 1 1 1 1 1 1 1 1 1 1
symmnumber: 1
zpe: 618925.7 jmol-1
zpe.correction: 0.235736 hartree
zpe.thermalcorrener: 0.246754 hartree
zpe.thermalcorrenthalpy: 0.247698 hartree
zpe.thermalcorrgfe: 0.200559 hartree
zpe.sumelectzpe: -464.964052 hartree
zpe.sumelectthermal: -464.953035 hartree
zpe.sumelectthermalent: -464.952091 hartree
zpe.sumelectthermalfe: -464.999230 hartree
dipole: -0.7684 1.2646 0.1941
dipole: 1.4924
quadrupole: -67.2070 -69.5559 -67.2752
quadrupole: 5.1010 0.2808 -1.2459
quadrupole: 0.8057 -1.5432 0.7375 5.1010 0.2808 -1.2459
hfenergy: -465.1997886 hartree
pointgroup: C01 [X(C10H16O1)]
dipole: -0.2965998 0.4963741 0.1018803 debye
polarizability: 114.4679099|7.9133729|111.1487416|-0.6823077|-0.8392138|91.4413865 unknown
InChI: InChI=1S/C10H16O/c1-6-8-4-7(5-9(6)11)10(8,2)3/h7-9,11H,1,4-5H2,2-3H3
charge 0 multiplicity 1
27 atoms
O  2.581973 -0.903644 -0.235138
C  -1.451497 0.108569 0.179673
C  -0.722276 -1.299393 0.114715
C  -0.366853 0.561733 -0.911706
C  -0.298059 -0.949397 -1.356469
C  0.539846 -1.31841 1.008616
C  0.915918 0.930161 -0.200035
C  1.554873 -0.212851 0.604494
C  -1.501952 0.864664 1.518773
C  -2.874977 0.058494 -0.419094
C  1.494978 2.159282 -0.242694
H  -1.349195 -2.192946 0.282013
H  -0.679808 1.325256 -1.644496
H  -1.070543 -1.202635 -2.099445
H  0.681313 -1.326413 -1.686912
H  1.063774 -2.28645 0.908011
H  0.255052 -1.205016 2.070862
H  2.064535 0.201252 1.499685
H  -0.511094 0.977731 1.990133
H  -1.910846 1.882829 1.371971
H  -2.162662 0.3388 2.235076
H  -3.264005 1.081326 -0.584829
H  -2.91526 -0.477876 -1.382725
H  -3.564914 -0.453774 0.278945
H  2.396124 2.392731 0.33992
H  1.082114 2.970912 -0.853054
H  3.145442 -0.204036 -0.657589
