program: Gaussian 09
title: 000102653
version: EM64L-G09RevD.01
frameworkgroup: C1[X(C21H30N2O)]
method: RPBEPBE
basis: SDD
operation: Freq
keyword: #p
keyword: freq=noraman
keyword: PBEPBE/SDD
title: #p freq=noraman PBEPBE/SDD
converged: YES YES NO NO
title: Mulliken charges:
elementType: O N N C C C C C C C C C C C C C C C C C C C C C H H H H H H H H H H H H H H H H H H H H H H H H H H H H H H
charge: -0.253599 -0.102677 -0.602555 0.151981 -0.060914 -0.543062 0.284459 -0.421334 0.087412 -0.734210 -0.770098 0.159057 -0.390802 0.386789 -0.315250 -0.325138 -0.296462 -0.342638 -0.482693 -0.442835 -0.680584 -0.671081 -0.305660 -0.249479 0.222918 0.206411 0.278780 0.236063 0.209673 0.214966 0.240169 0.205109 0.205855 0.283663 0.208473 0.245480 0.185889 0.194387 0.184223 0.202242 0.228180 0.327275 0.341429 0.265869 0.240942 0.239007 0.208865 0.229415 0.205673 0.203899 0.228710 0.214644 0.232356 0.230808
chargesum: 0.00000
title: Mulliken charges with hydrogens summed into heavy atoms:
elementType: O N N C C C C C C C C C C C C C C C C C C C C C
charge: -0.253599 -0.102677 0.066149 0.151981 0.162004 -0.057871 0.284459 0.024403 0.087412 -0.073966 -0.072108 0.159057 -0.145322 0.386789 0.065026 0.061327 -0.068282 -0.076769 -0.241750 -0.203828 -0.036631 -0.023828 -0.073304 -0.018671
polarizability: 3.04356698e+02 -4.80515279e+00 2.54717419e+02 -2.04519544e+01 2.78512080e+00 1.83662466e+02
1716.lowfreq: -11.9351 -8.8801 -0.0006 -0.0004 -0.0002 3.7329 25.1611 30.2476 39.6022
frequency: 25.1146 30.1935 39.4530 51.9007 60.6273 66.9383 73.9579 78.8167 107.2004 116.9311 142.7520 160.5715 165.3165 176.7267 189.2366 196.6286 211.2475 219.7962 241.8007 267.4735 286.8940 297.0225 303.1615 304.5596 332.3161 337.8557 354.4212 383.0351 407.9045 432.2061 434.2918 440.1300 457.9919 474.3923 491.1488 518.0528 524.9568 534.3543 552.6805 576.8587 588.6156 613.1209 653.2152 658.4755 729.9928 732.4083 747.1725 768.2396 785.0518 787.9897 794.4390 797.9852 802.8891 815.2281 868.1522 873.7800 884.8065 914.3550 915.9076 922.7168 944.8500 956.4711 963.8562 969.3220 984.4279 993.2941 995.3955 1027.0431 1039.2518 1053.5858 1063.3359 1068.2172 1072.8794 1081.9792 1084.9588 1090.6256 1112.3834 1133.9011 1140.9822 1153.2419 1165.3548 1175.4634 1181.7877 1190.0629 1203.8046 1225.2129 1234.2814 1254.9759 1268.0236 1275.8712 1282.6930 1289.3346 1294.9719 1310.7719 1325.5431 1330.8259 1358.4403 1361.0373 1366.6691 1374.6663 1378.2796 1384.7124 1389.4350 1394.7146 1401.1503 1408.7199 1439.3707 1454.4457 1461.8318 1461.9497 1463.5651 1469.6217 1473.1768 1475.6244 1478.7566 1485.0149 1486.1493 1490.8616 1492.6634 1499.5928 1515.9083 1572.1936 1584.3343 1599.7717 1621.4174 1629.2652 2840.5624 2850.2832 2870.5267 2974.5513 2981.8729 2983.2137 2983.5170 3002.6213 3012.0811 3013.2381 3034.5328 3057.0698 3059.5307 3067.9180 3074.6540 3076.2035 3086.2678 3088.7333 3091.8524 3092.3671 3115.1231 3119.9845 3122.8564 3135.2024 3145.8009 3155.9669 3172.1849 3173.7104 3503.3015 3659.0957
redmass: 3.4084 4.0080 3.9620 3.5962 2.9586 3.8487 2.1341 3.0919 2.5081 3.3937 3.7188 2.9797 3.1771 1.6099 2.2792 3.0797 1.5128 1.3144 1.7413 1.2908 2.1609 2.5048 3.3913 2.8245 2.9470 3.1432 3.3497 3.4926 3.0330 2.7220 3.4760 2.7152 2.7465 3.2507 3.1156 5.3017 3.1087 1.4073 2.2233 2.2942 2.0575 2.9887 3.5983 4.0162 2.0866 3.5935 1.2738 2.4873 3.4905 2.2927 1.1404 1.2955 2.4861 1.7176 1.9921 2.2652 2.1305 1.4416 1.5416 1.4846 2.6180 1.8658 1.5377 2.0438 1.3732 2.3965 1.3597 3.0671 2.3807 2.1547 2.5187 2.1027 1.9305 2.7451 2.1750 2.1997 1.9202 2.1416 2.2675 1.5038 1.6163 1.9574 1.2097 1.4728 2.3072 1.9848 1.8757 1.5544 1.3442 1.6279 1.2088 1.2623 1.4420 1.5220 1.7569 1.3678 1.3697 2.1710 1.3422 1.3414 1.2040 1.2255 1.2251 1.2066 2.8355 4.0458 2.5128 1.9448 1.0918 1.0726 1.0567 1.0619 1.0556 1.0572 1.0566 1.0616 1.0701 1.0776 1.0748 1.0506 3.5825 1.8087 6.3756 5.1050 2.5837 6.1509 1.0719 1.0719 1.0707 1.0375 1.0380 1.0358 1.0359 1.0658 1.0826 1.0853 1.0868 1.0948 1.0896 1.0973 1.0985 1.0978 1.0955 1.0985 1.1003 1.1002 1.0981 1.0869 1.0862 1.0898 1.0947 1.0963 1.0937 1.0960 1.0444 1.1044
irintensity: 0.0144 0.3828 0.7052 2.2420 1.6259 6.6550 0.0488 0.2343 0.7255 0.0157 1.0917 0.2501 1.3211 0.8621 0.9875 1.5996 1.9224 0.4850 2.3312 0.3582 1.0419 0.5008 4.1461 1.3531 3.1110 1.6904 4.6060 1.4560 7.6395 2.5518 2.4812 4.6201 10.4540 1.5781 1.9513 1.8765 34.8309 197.8182 6.6269 8.6530 38.5922 38.3104 0.7723 5.6396 8.0420 5.1739 4.7083 5.8631 12.7232 44.5790 4.7412 21.0058 4.2981 45.8756 1.9176 1.6845 5.7224 1.9775 2.7073 3.1139 0.9603 1.2374 1.7296 0.9015 1.8672 13.3118 0.4535 6.0619 3.9809 8.4090 9.0814 3.3358 20.7675 13.4884 4.0530 14.8190 13.9854 5.1613 5.6494 7.7972 31.7558 10.5179 6.9062 6.9158 36.6830 5.7834 2.8700 3.9031 20.1179 5.2341 2.8022 42.1495 0.1765 33.6980 22.8859 13.8398 3.8112 8.9241 5.3377 4.1265 24.7531 20.0708 19.5754 31.0856 5.2877 7.3065 7.3271 1.1204 5.1314 5.7207 5.7440 3.0524 4.3071 4.2128 1.7407 15.3920 6.1400 5.8837 9.9027 19.6754 12.6295 83.1925 10.1449 10.7330 201.5266 7.1996 38.5566 106.6800 158.6968 15.2093 46.1806 42.3972 30.7382 20.1579 8.4382 39.0514 20.7141 2.2673 12.1217 80.6194 25.9989 91.2331 17.5838 42.9181 38.2000 40.9284 4.5304 1.6597 2.7829 12.4167 28.6776 35.7437 22.1044 4.6362 22.7569 28.9690
temp: 298.150 k
press: 1.00000 atm
elementType: 8 7 7 6 6 6 6 6 6 6 6 6 6 6 6 6 6 6 6 6 6 6 6 6 1 1 1 1 1 1 1 1 1 1 1 1 1 1 1 1 1 1 1 1 1 1 1 1 1 1 1 1 1 1
symmnumber: 1
zpe: 1221259.2 jmol-1
zpe.correction: 0.465153 hartree
zpe.thermalcorrener: 0.490489 hartree
zpe.thermalcorrenthalpy: 0.491433 hartree
zpe.thermalcorrgfe: 0.409943 hartree
zpe.sumelectzpe: -1001.140098 hartree
zpe.sumelectthermal: -1001.114762 hartree
zpe.sumelectthermalent: -1001.113818 hartree
zpe.sumelectthermalfe: -1001.195308 hartree
dipole: 0.3556 3.6482 -1.7279
dipole: 4.0524
quadrupole: -136.2098 -151.4234 -142.3295
quadrupole: -2.6658 -1.0859 0.6595
quadrupole: 7.1111 -8.1025 0.9914 -2.6658 -1.0859 0.6595
hfenergy: -1001.6052509 hartree
pointgroup: C01 [X(C21H30N2O1)]
dipole: 0.1210248 -1.5892736 0.0382272 debye
polarizability: 305.8879202|-3.4388517|241.2262693|16.2285642|28.0007555|195.6223929 unknown
InChI: InChI=1S/C21H30N2O/c1-5-23(6-2)15-14-21(16(3)4,20(22)24)19-13-9-11-17-10-7-8-12-18(17)19/h7-13,16H,5-6,14-15,22H2,1-4H3
charge 0 multiplicity 1
54 atoms
O  0.115177 2.563122 1.768993
N  -3.744993 -0.488322 0.235175
N  0.231482 0.330365 2.319296
C  -0.045403 0.898588 -0.099768
C  0.409949 2.070867 -1.091208
C  -1.589108 0.659267 -0.298748
C  0.826733 -0.35512 -0.388883
C  -2.321174 -0.332453 0.639935
C  0.123375 1.351088 1.391648
C  0.581781 1.571385 -2.548797
C  -0.510229 3.319648 -1.089144
C  2.254616 -0.379488 -0.088588
C  0.275327 -1.469277 -1.040334
C  3.039456 -1.545351 -0.46578
C  -3.922363 -1.454043 -0.882058
C  -4.644235 -0.7650 1.387938
C  1.048881 -2.611029 -1.407419
C  2.954995 0.695761 0.564736
C  2.410967 -2.651788 -1.124501
C  4.446252 -1.585949 -0.183599
C  -5.21098 -1.214247 -1.692488
C  -4.930039 0.488972 2.236399
C  4.325494 0.629082 0.824197
C  5.085861 -0.520535 0.448033
H  1.402864 2.406742 -0.737137
H  -1.765847 0.371519 -1.35284
H  -2.0950 1.628996 -0.164998
H  -2.299396 0.071322 1.665772
H  -1.803009 -1.3223 0.68255
H  0.844482 2.427295 -3.197591
H  1.376217 0.812827 -2.64833
H  -0.35684 1.136739 -2.942727
H  0.001111 4.138323 -1.630368
H  -0.717199 3.66333 -0.064221
H  -1.46414 3.129295 -1.61455
H  -0.784268 -1.470471 -1.30544
H  -3.894866 -2.513434 -0.516276
H  -3.060845 -1.340731 -1.567387
H  -4.234525 -1.579272 2.039538
H  -5.602674 -1.141157 0.986531
H  0.560354 -3.448711 -1.917016
H  0.331599 0.5815 3.302947
H  0.321394 -0.644015 2.033908
H  2.416025 1.590972 0.882995
H  3.019415 -3.520187 -1.403504
H  5.011395 -2.478181 -0.479248
H  -6.118889 -1.343404 -1.076101
H  -5.21787 -0.186239 -2.094453
H  -5.27653 -1.927394 -2.535629
H  -5.610876 0.244165 3.073397
H  -5.399797 1.268995 1.612617
H  -4.006545 0.914394 2.669235
H  4.821652 1.467885 1.324616
H  6.160284 -0.560144 0.657678
