program: Gaussian 09
title: 000102651
version: EM64L-G09RevD.01
frameworkgroup: C1[X(C12H16N6O6)]
method: RPBEPBE
basis: SDD
operation: Freq
keyword: #p
keyword: freq=noraman
keyword: PBEPBE/SDD
title: #p freq=noraman PBEPBE/SDD
converged: YES YES NO NO
title: Mulliken charges:
elementType: O O O O O O N N N N N N C C C C C C C C C C C C H H H H H H H H H H H H H H H H
charge: -0.407600 -0.208585 -0.192121 -0.243180 -0.216708 -0.207180 -0.413472 -0.101065 0.023112 0.015016 -0.652423 -0.665956 -0.185390 -0.394908 -0.382597 -0.450970 0.331907 0.123511 0.243005 -0.278177 -0.508117 -0.425133 0.448324 0.236195 0.270188 0.221517 0.234854 0.229429 0.225643 0.398013 0.183989 0.189861 0.258961 0.336686 0.291276 0.395554 0.298395 0.333350 0.341787 0.303012
chargesum: 0.00000
title: Mulliken charges with hydrogens summed into heavy atoms:
elementType: O O O O O O N N N N N N C C C C C C C C C C C C
charge: -0.012046 -0.208585 -0.192121 -0.243180 -0.216708 -0.207180 -0.015459 -0.101065 0.023112 0.015016 -0.020678 -0.021157 0.084798 0.061463 0.072475 -0.077120 0.331907 0.123511 0.243005 -0.019217 -0.171431 -0.133857 0.448324 0.236195
polarizability: 2.64145250e+02 -5.34474426e+01 1.87277538e+02 1.26177887e+00 1.96139882e+01 2.13133371e+02
1716.lowfreq: -252.5818 -5.5666 -0.0006 -0.0005 0.0002 1.7366 2.7866 13.1916 20.3036
frequency: -252.5816 13.1648 20.2765 24.5846 43.1868 55.7157 60.8845 64.3622 72.9016 79.8470 90.4054 106.1307 107.5974 154.9116 166.9169 176.7265 201.7631 232.1495 236.0859 271.3503 290.7609 312.5430 323.4798 353.6291 357.9227 361.1131 367.7737 397.0137 439.1123 455.3541 483.8641 496.2137 498.8191 514.2184 532.0777 563.4633 577.3552 607.1425 631.5649 644.0432 654.5070 674.9057 679.4904 705.8012 725.7924 734.9983 746.0419 755.9914 796.2651 820.9113 837.1077 845.0755 855.2005 888.7891 895.7825 958.4234 968.8427 976.2691 992.3513 1010.5019 1040.7547 1055.5196 1057.8227 1068.9257 1092.2538 1108.0855 1125.0921 1148.0009 1168.3566 1184.1410 1187.6785 1208.9332 1218.9374 1248.9363 1261.8392 1279.8262 1290.8821 1294.9309 1297.9830 1344.7798 1350.4880 1362.2718 1364.6569 1373.4672 1389.1364 1426.3106 1451.9326 1456.3710 1457.3314 1472.9522 1477.9231 1529.1888 1576.8283 1596.9600 1627.1781 1629.8727 1668.3245 1670.0873 2843.2109 2882.1474 2984.1248 2995.3699 3000.0129 3040.5773 3067.8977 3170.7193 3187.5173 3189.4886 3284.8101 3522.7052 3564.3477 3573.2553 3708.0401 3726.8312
redmass: 1.2030 7.1871 5.8506 4.7045 5.6001 12.6371 9.0815 5.2409 10.1091 5.0569 6.3856 2.2351 5.2411 10.8966 5.1091 5.2161 5.0964 2.6071 3.8766 4.0088 4.3255 5.3356 9.1376 1.3405 2.6297 1.4252 12.3804 8.3446 3.7880 4.4795 2.7174 1.0731 6.5424 3.9722 3.4388 3.1732 3.5605 4.9823 1.5560 6.5020 6.9319 8.5394 8.0674 7.5620 4.7382 4.4722 1.2012 11.8741 3.2740 1.7293 1.2058 2.2818 2.1570 6.0974 3.8716 2.5393 1.4104 1.7519 1.3312 1.8068 2.8168 2.2795 2.5256 3.8446 2.2704 3.3698 2.3416 1.3238 2.9875 2.1284 2.2343 1.5964 3.4148 1.7184 1.3345 1.2874 1.2263 1.1879 1.8422 4.4029 1.6736 5.0867 1.8544 1.6915 3.3689 4.0922 4.2905 1.0802 1.1156 1.0992 2.5738 4.3396 5.4498 1.2764 1.4318 6.4136 4.0089 4.7902 1.0543 1.1012 1.0650 1.0754 1.0627 1.1004 1.1038 1.0877 1.0923 1.0963 1.0784 1.0643 1.0457 1.0450 1.1028 1.1052
irintensity: 24.9253 1.1639 2.7193 2.4360 1.0950 0.0622 1.5086 0.5855 0.5322 3.8324 2.0532 0.5891 1.4737 1.2117 2.3568 3.1828 0.8300 16.4628 0.3786 2.1383 1.0890 1.8395 0.2778 162.3547 131.9016 221.4958 3.7768 1.8949 0.3487 24.1872 7.1989 69.8700 17.1348 14.3259 32.0275 49.2648 10.5300 7.7122 92.2329 15.9268 11.4070 26.6409 16.5907 13.3585 13.4207 3.8413 15.0684 14.7084 13.0741 97.4027 59.3864 12.8190 6.5789 13.2304 1.7783 3.0616 25.4817 11.5358 0.8276 3.2125 76.0119 262.7872 64.0097 10.4630 13.2533 30.8301 13.2082 18.9744 235.4837 208.1655 11.5343 73.0678 326.2011 49.5600 6.0961 8.0434 5.7803 12.1466 123.4414 142.1121 33.1110 61.9243 62.3175 77.3123 15.9034 119.9420 6.0069 11.6854 2.3401 16.2650 6.9843 148.3679 166.1964 132.0737 177.5905 402.9017 514.4441 296.5983 90.3896 62.2744 10.1835 17.2537 29.7623 2.2956 62.1149 3.1838 9.9554 17.4514 137.2818 51.6155 26.5504 38.5925 21.4335 31.7713
temp: 298.150 k
press: 1.00000 atm
elementType: 8 8 8 8 8 8 7 7 7 7 7 7 6 6 6 6 6 6 6 6 6 6 6 6 1 1 1 1 1 1 1 1 1 1 1 1 1 1 1 1
symmnumber: 1
zpe: 778861.6 jmol-1
zpe.correction: 0.296653 hartree
zpe.thermalcorrener: 0.320502 hartree
zpe.thermalcorrenthalpy: 0.321446 hartree
zpe.thermalcorrgfe: 0.239146 hartree
zpe.sumelectzpe: -1244.784704 hartree
zpe.sumelectthermal: -1244.760855 hartree
zpe.sumelectthermalent: -1244.759911 hartree
zpe.sumelectthermalfe: -1244.842211 hartree
dipole: -9.6537 -0.6046 -6.1956
dipole: 11.4867
quadrupole: -145.5394 -128.6558 -147.2195
quadrupole: 33.6979 -0.3689 -12.7493
quadrupole: -5.0678 11.8158 -6.7480 33.6979 -0.3689 -12.7493
hfenergy: -1245.0813566 hartree
pointgroup: C01 [X(C12H16N6O6)]
dipole: 3.7779382 -0.2230307 2.4699992 debye
polarizability: 265.1865997|52.8275869|185.4082751|0.3105703|-18.6546182|213.9612843 unknown
InChI: InChI=1S/C12H16N6O6/c13-12(14)15-5-1-2-9(11(19)20)16-8-4-3-7(17(21)22)6-10(8)18(23)24/h3-4,6,9,16,19H,1-2,5,13-14H2
charge 0 multiplicity 1
40 atoms
O  2.284452 3.542383 1.725588
O  1.506198 3.554038 -0.467334
O  -2.69711 0.472245 -3.250205
O  -0.870388 1.605331 -2.501297
O  -5.017012 -2.299962 1.860371
O  -5.506105 -2.10031 -0.364026
N  -0.177151 1.457557 0.029319
N  4.471064 -1.228415 -0.503352
N  -1.900616 0.822823 -2.300423
N  -4.773858 -1.847484 0.670737
N  6.123888 -2.513442 -1.536226
N  5.436914 -3.138007 0.634721
C  0.758339 1.793652 1.108448
C  1.756134 0.638783 1.456147
C  2.692665 0.252382 0.294527
C  3.596058 -0.94712 0.645801
C  -1.278455 0.661309 0.171288
C  1.526437 3.041889 0.66964
C  -2.150814 0.330855 -0.941707
C  -1.64327 0.106029 1.45101
C  -3.286832 -0.486694 -0.774155
C  -2.769121 -0.694318 1.616756
C  -3.589886 -0.993826 0.495406
C  5.295204 -2.25193 -0.444432
H  0.203831 2.066042 2.028392
H  1.161822 -0.242991 1.767141
H  2.344572 0.963783 2.335431
H  2.111787 -0.00727 -0.61012
H  3.347004 1.100036 0.014808
H  -0.007562 1.849004 -0.916501
H  2.941008 -1.816742 0.908612
H  4.178115 -0.697566 1.568662
H  -1.023592 0.325397 2.323105
H  -3.919362 -0.716813 -1.63533
H  -3.03872 -1.102808 2.594341
H  2.798924 4.339356 1.424023
H  6.770599 -3.294278 -1.572053
H  6.030694 -1.892374 -2.33455
H  4.860367 -3.011721 1.460037
H  6.082479 -3.922923 0.619199
