program: Gaussian 09
title: 000102650
version: EM64L-G09RevD.01
frameworkgroup: C1[X(C11H12O)]
method: RPBEPBE
basis: SDD
operation: Freq
keyword: #pfreq=noraman
keyword: PBEPBE/SDD
title: #p freq=noraman PBEPBE/SDD
converged: YES YES NO NO
title: Mulliken charges:
elementType: O C C C C C C C C C C C H H H H H H H H H H H H
charge: -0.222452 -0.134892 -0.430982 -0.571412 0.390893 0.048605 0.110380 -0.724182 -0.409988 -0.353143 -0.225498 -0.243677 0.227942 0.210107 0.216242 0.224334 0.230018 0.208921 0.215701 0.250267 0.236521 0.280727 0.230706 0.234862
chargesum: 0.00000
title: Mulliken charges with hydrogens summed into heavy atoms:
elementType: O C C C C C C C C C C C
charge: -0.222452 0.093049 -0.004633 -0.117061 0.390893 0.048605 0.110380 -0.049293 -0.173466 -0.072416 0.005208 -0.008815
polarizability: 1.56469519e+02 -2.43870839e+00 1.25456670e+02 -2.59605372e+00 -2.09515705e+00 6.51252279e+01
1716.lowfreq: -12.3040 0.0002 0.0006 0.0007 13.1191 20.9611 46.1667 119.7806 155.4931
frequency: 46.0974 119.7413 155.4834 180.9595 228.9909 259.0204 312.0040 339.0757 374.6658 430.8190 442.1078 490.6367 505.0604 564.0350 610.1183 665.5813 701.9808 745.3362 782.2333 800.6372 842.5012 890.7394 905.9395 943.6274 961.9883 978.7781 1006.2245 1023.5361 1041.1964 1071.7807 1083.8026 1117.9265 1130.5229 1171.5602 1175.5314 1206.8799 1217.1354 1230.5034 1269.3079 1276.7684 1313.2918 1331.2194 1357.5808 1386.9721 1388.2286 1441.5606 1452.9137 1463.9037 1469.5457 1476.9715 1479.9813 1569.8620 1587.4257 1617.9196 2922.0857 2954.2268 2984.3165 2988.4250 3032.5470 3047.1284 3079.1165 3103.8383 3119.4134 3136.0203 3149.6534 3165.3845
redmass: 4.1140 3.9795 1.1969 2.2091 2.7137 2.4627 4.7978 2.7437 5.0460 3.8734 3.2362 3.6783 3.9926 4.3723 3.1484 5.1614 3.7381 1.7652 2.3286 2.2877 2.2730 1.3630 2.1166 1.3488 2.9008 1.3791 1.3407 2.3599 1.7505 2.2702 2.2121 1.4024 1.8689 1.1649 1.4784 2.1620 1.3671 2.3828 1.4505 1.3471 1.5848 1.7625 1.6447 3.2311 1.5226 2.4132 1.1896 1.0552 1.1044 1.8919 1.1233 8.5169 7.1943 7.0853 1.0799 1.0665 1.0578 1.0398 1.0928 1.1030 1.1000 1.0987 1.0870 1.0892 1.0936 1.1001
irintensity: 2.1893 1.3992 0.0522 0.5388 0.3167 1.3665 10.3814 1.0749 4.4808 1.9900 3.1963 3.6150 2.3610 2.0244 2.7771 3.7511 5.2565 47.2054 11.3534 19.7104 1.0223 1.1598 20.4962 6.1788 28.2219 3.7208 0.2527 4.1358 2.2031 0.8116 5.0595 3.1893 6.4388 6.7042 0.5565 1.7522 5.7400 89.6461 13.2585 8.9946 26.2720 5.3514 8.1031 5.5316 27.2525 20.3899 17.7365 10.5396 10.0643 2.4832 17.2890 90.6734 69.1869 31.0132 15.8550 19.8941 17.5452 56.4147 35.6899 35.8620 41.4612 15.6195 5.8707 13.1598 11.0041 29.5679
temp: 298.150 k
press: 1.00000 atm
elementType: 8 6 6 6 6 6 6 6 6 6 6 6 1 1 1 1 1 1 1 1 1 1 1 1
symmnumber: 1
zpe: 522291.8 jmol-1
zpe.correction: 0.198930 hartree
zpe.thermalcorrener: 0.209171 hartree
zpe.thermalcorrenthalpy: 0.210115 hartree
zpe.thermalcorrgfe: 0.163145 hartree
zpe.sumelectzpe: -500.737845 hartree
zpe.sumelectthermal: -500.727605 hartree
zpe.sumelectthermalent: -500.726661 hartree
zpe.sumelectthermalfe: -500.773631 hartree
dipole: -1.2647 3.4521 -0.2433
dipole: 3.6845
quadrupole: -64.1435 -72.4838 -72.6683
quadrupole: 5.3987 -1.0326 -0.4546
quadrupole: 5.6217 -2.7186 -2.9031 5.3987 -1.0326 -0.4546
hfenergy: -500.9367759 hartree
pointgroup: C01 [X(C11H12O1)]
dipole: 0.4971448 1.3576163 0.1052485 debye
dipolederiv: -0.7548099 -0.1200699 0.0011466 -0.3400124 -0.8927851 -0.0100065 0.0095736 -0.0434384 -0.3112603 -0.1499092 0.1329653 0.0168834 0.1746106 -0.1436304 -0.036051 0.0811675 -0.0682658 0.1471652 0.0141237 -0.0595468 -0.0114473 -0.0679994 0.0561335 0.0165423 0.0124849 -0.0014615 0.1362257 -0.0134108 0.0471765 -0.0166897 0.0273365 0.0314177 -0.0178779 0.0303088 -0.089822 0.1442191 0.2491157 -0.2231953 -0.0441976 0.009269 0.1602954 0.0101099 -0.0793218 0.0738606 -0.0199044 1.480538 0.1431473 -0.0609126 0.1783241 0.904851 0.0683193 -0.1209257 0.1005167 0.1070558 -0.7841652 -0.1613679 0.0198496 0.005303 -0.1751255 -0.0099162 0.0573541 -0.0201714 -0.0245687 -0.0144531 -0.070154 -0.031772 -0.0200285 0.0075899 0.0118216 -0.0212712 0.0333101 0.08078 -0.2883295 0.2067284 0.0134171 0.1485109 0.066629 0.0126334 0.0222479 0.0044624 -0.1716615 0.0874938 0.1528753 -0.0049389 -0.1208359 0.0306948 0.0125529 -0.0177317 -0.0004418 -0.0977228 0.1306055 0.0096723 -0.0199691 0.0410309 0.1102411 0.0070815 -0.0050981 0.0010759 -0.1246583 -0.0672207 -0.2049947 -0.0146217 -0.1864039 -0.0770587 0.0084038 -0.0115984 0.0125467 -0.173239 0.0391236 0.0020376 -0.0358329 0.0198059 0.0400157 -0.0382788 -0.0376966 -0.0036135 -0.1332518 -0.09734 0.1496626 0.0052424 0.1487838 -0.0705534 -0.0036384 0.0306702 -0.02409 0.0764563 0.0702777 -0.0249657 0.0186769 -0.0428264 0.0559633 -0.0582423 -0.0126597 0.0038434 -0.1534698 0.0078329 0.0767591 0.0367966 0.0401644 0.0423401 -0.0320991 0.0154464 -0.0746128 -0.1215484 -0.0152682 -0.0872569 0.0358627 -0.0461733 -0.1017859 0.0661121 0.0085127 0.1119551 0.0518567 -0.0845215 0.0897214 0.0225623 0.1697536 -0.0263848 -0.0504819 0.0342512 -0.0511554 0.0725003 0.0604017 0.00167 0.0383559 -0.0155557 0.0911358 -0.0125935 -0.0423898 -0.0240549 -0.1521455 0.0977807 -0.0353754 0.0102573 -0.1180186 -0.0503777 0.0744359 0.0233074 0.0714023 0.0579423 0.0722 -0.022055 0.0009144 -0.0678999 -0.1142211 -0.0055177 -0.0020149 0.0012478 0.1472044 0.1224811 -0.054744 -0.0004546 0.0053391 -0.0104852 -0.0045151 0.0034114 -0.0033235 0.1496456 -0.1229096 -0.0480106 0.0095582 -0.0550195 0.0786337 0.0015553 0.0109047 0.0004872 0.15275 -0.0396367 0.0993206 0.0113132 0.1125417 -0.013533 -0.0103496 0.0110671 -0.010257 0.1596289 unknown
polarizability: 156.5101626|2.4163443|125.4383644|-1.7708961|2.3435547|65.1028894 unknown
InChI: InChI=1S/C11H12O/c1-8-6-7-9-4-2-3-5-10(9)11(8)12/h2-5,8H,6-7H2,1H3
charge 0 multiplicity 1
24 atoms
O  -1.399048 -2.108743 0.009875
C  -2.154053 0.207155 0.274769
C  -1.704369 1.532166 -0.392525
C  -0.353798 2.008878 0.179674
C  0.715182 0.930687 0.0794
C  -1.083879 -0.884095 0.091849
C  0.351762 -0.449196 0.040641
C  -3.54283 -0.264468 -0.196461
C  2.088368 1.273092 0.027801
C  1.359977 -1.448165 -0.042609
C  3.084512 0.276234 -0.051065
C  2.719946 -1.093228 -0.085241
H  -2.198353 0.393164 1.373693
H  -2.480853 2.303455 -0.230619
H  -1.618603 1.380141 -1.487152
H  -0.494763 2.282269 1.24747
H  -0.011443 2.927219 -0.332817
H  -4.315543 0.477942 0.0733
H  -3.558393 -0.398646 -1.293666
H  -3.802202 -1.234345 0.258562
H  2.377808 2.330976 0.044917
H  1.039774 -2.49511 -0.0710
H  4.141472 0.563305 -0.091702
H  3.492528 -1.867087 -0.146794
