program: Gaussian 09
title: 000102627
version: EM64L-G09RevD.01
frameworkgroup: C1[X(C4H3Br3F3NO2)]
method: RPBEPBE
basis: SDD
operation: Freq
keyword: #p
keyword: freq=noraman
keyword: PBEPBE/SDD
title: #p freq=noraman PBEPBE/SDD
converged: YES YES NO NO
title: Mulliken charges:
elementType: Br Br Br F F F O O N C C C C H H H
charge: 0.182368 0.163120 0.172341 -0.171913 -0.135230 -0.133526 -0.367561 -0.196991 -0.330487 -0.052435 -0.735955 0.201888 0.325346 0.320154 0.378038 0.380842
chargesum: 0.00000
title: Mulliken charges with hydrogens summed into heavy atoms:
elementType: Br Br Br F F F O O N C C C C
charge: 0.182368 0.163120 0.172341 -0.171913 -0.135230 -0.133526 0.013281 -0.196991 0.047550 0.267719 -0.735955 0.201888 0.325346
polarizability: 1.21527071e+02 7.75061517e+00 1.10374657e+02 1.21154719e+01 -3.78620173e+00 9.51521212e+01
1716.lowfreq: -25.8659 -2.2319 -0.0007 -0.0002 -0.0001 5.4509 6.2889 20.2538 32.0113
frequency: -24.9022 20.2378 31.9996 40.0699 49.2657 117.6676 125.0230 142.2687 168.1704 173.2557 177.3543 215.4149 243.5552 273.2694 283.3681 374.2763 391.8908 439.1194 477.8706 493.7604 538.9723 635.5498 682.4359 690.1855 693.0857 713.3958 825.5259 956.8361 993.5072 1018.8095 1042.1440 1065.4784 1125.8360 1217.4426 1238.6828 1320.9921 1376.2847 1481.7819 1650.3937 3034.6845 3513.3111 3585.8513
redmass: 1.4950 18.2590 17.6260 16.7274 4.3188 22.8764 16.2591 10.9704 18.3583 25.6827 12.6150 22.1443 9.5040 14.4991 8.7747 13.5998 7.5730 14.5490 5.9318 5.3714 5.9194 13.2537 2.0006 2.9252 9.7934 12.2642 11.2915 4.0827 6.8698 9.1841 12.8592 8.0385 6.8610 1.2031 2.0354 1.4286 1.2657 1.8110 10.4351 1.0856 1.0780 1.0674
irintensity: 77.7411 1.1460 1.1878 2.4475 18.2951 3.4567 1.0087 1.7076 2.0373 1.7601 6.0998 1.1814 5.9982 10.9303 1.9627 6.8920 32.9690 11.6308 5.1965 41.7385 23.7728 20.3592 118.0581 143.9386 162.4438 46.7232 31.3954 68.2697 33.8359 182.1836 239.7606 30.4223 325.1509 9.9322 35.7278 14.6997 18.5586 238.6649 230.2816 13.3530 60.7462 41.8967
temp: 298.150 k
press: 1.00000 atm
elementType: 35 35 35 9 9 9 8 8 7 6 6 6 6 1 1 1
symmnumber: 1
zpe: 201206.0 jmol-1
zpe.correction: 0.076635 hartree
zpe.thermalcorrener: 0.091239 hartree
zpe.thermalcorrenthalpy: 0.092183 hartree
zpe.thermalcorrgfe: 0.030123 hartree
zpe.sumelectzpe: -698.303866 hartree
zpe.sumelectthermal: -698.289263 hartree
zpe.sumelectthermalent: -698.288319 hartree
zpe.sumelectthermalfe: -698.350378 hartree
dipole: 1.6304 1.0905 1.3904
dipole: 2.4044
quadrupole: -115.1960 -105.1906 -94.5087
quadrupole: -6.0268 1.7799 0.5688
quadrupole: -10.2309 -0.2255 10.4564 -6.0268 1.7799 0.5688
hfenergy: -698.3805017 hartree
pointgroup: C01 [X(C4H3Br3F3N1O2)]
dipole: 0.6418545 -0.4373845 0.5399337 debye
dipolederiv: -0.6085249 0.3357017 0.0786079 0.3467603 -0.3097349 -0.0800622 0.1230365 -0.0940129 -0.0605838 -0.1137985 -0.0230955 -0.0225226 -0.0535427 -0.3019632 -0.3785542 -0.0363611 -0.3346458 -0.5452723 -0.1455831 0.1275131 -0.2085307 0.1102934 -0.2385631 0.2915708 -0.1911845 0.2728826 -0.5419693 -0.4698493 0.0246071 -0.0116953 0.0199202 -0.4926413 -0.2650892 -0.0350551 -0.254129 -0.6104764 -0.7239596 -0.2295604 0.1157846 -0.1816232 -0.4818636 0.0762518 0.1401422 0.0996736 -0.2921656 -0.4749798 0.149664 -0.1289076 0.1595367 -0.4476721 0.2352369 -0.0881052 0.2019928 -0.5288545 -0.6172891 0.1018245 0.0749102 0.2028659 -0.5160383 0.3951286 0.0077093 0.4327357 -0.5656297 -0.603269 0.038726 -0.0130815 -0.2401573 -0.5239808 -0.3005686 -0.3666604 -0.2515392 -0.5996809 -1.509561 -0.1436313 -0.3336736 -0.1005168 -0.5114198 0.0819248 -0.1318697 -0.0126957 -0.5042016 1.0252813 0.0792557 -0.0028519 -0.209135 0.5243489 -0.5141584 -0.2974369 -0.4874636 0.2334577 0.8172134 -0.5450511 0.2208207 -0.4675062 0.9031644 0.2380039 0.1316802 0.1788018 1.3345182 1.1776834 0.0899759 0.3380774 0.3165232 0.4724159 0.4676916 0.7656504 0.462 0.7236537 1.5663851 0.1210303 0.0504677 0.0640959 1.3913143 -0.115338 -0.0123031 -0.112717 1.4100041 0.1009934 -0.0418818 -0.0582673 0.0275569 0.0288478 -0.0169838 0.0814072 0.0504843 0.0243207 0.2941134 0.0240167 -0.0640153 0.09643 0.296883 -0.0448554 -0.031946 -0.0608684 0.2575185 0.2851443 -0.1090947 -0.0351225 -0.0915013 0.2069029 -0.0701985 -0.0587037 -0.0904994 0.2653612 unknown
polarizability: 121.4695114|-10.1911216|98.3067683|10.407191|6.9219621|107.2775691 unknown
InChI: InChI=1S/C4H3Br3F3NO2/c5-3(6,7)1(12)11-2(13)4(8,9)10/h1,11-12H
charge 0 multiplicity 1
16 atoms
Br 3.992891 -0.762841 -0.590467
Br 2.594944 1.503843 1.338342
Br 1.796181 1.31468 -1.852762
F  -2.271669 1.22855 1.133695
F  -3.536741 -0.495895 0.363956
F  -2.969909 1.19947 -1.029854
O  1.55917 -1.493218 1.285264
O  -1.276513 -1.221758 -1.363336
N  -0.112237 -0.079781 0.327277
C  1.162462 -0.757514 0.101721
C  2.308043 0.256843 -0.217062
C  -1.226534 -0.396511 -0.417613
C  -2.503743 0.382633 0.009107
H  1.030732 -1.40652 -0.785616
H  -0.175246 0.578421 1.111093
H  1.295069 -2.443302 1.200356
