program: Gaussian 09
title: 000102618
version: EM64L-G09RevD.01
frameworkgroup: C1[X(C5H10O)]
method: RPBEPBE
basis: SDD
operation: Freq
keyword: #pfreq=noraman
keyword: PBEPBE/SDD
title: #p freq=noraman PBEPBE/SDD
converged: NO YES NO NO
title: Mulliken charges:
elementType: O C C C C C H H H H H H H H H H
charge: -0.306504 -0.010614 -0.080537 -0.382582 -0.698991 -0.697743 0.230252 0.207486 0.218269 0.214666 0.207140 0.220450 0.220220 0.201687 0.213200 0.243600
chargesum: 0.00000
title: Mulliken charges with hydrogens summed into heavy atoms:
elementType: O C C C C C
charge: -0.306504 0.219638 0.126949 0.050353 -0.051181 -0.039255
polarizability: 6.36490789e+01 -3.02260365e+00 5.48040237e+01 -2.02320934e+00 8.89226421e-01 4.83206497e+01
1716.lowfreq: -11.6092 -3.9836 -0.0005 -0.0005 -0.0004 13.5842 84.1443 193.0881 205.1380
frequency: 84.1325 193.0784 205.1329 224.3397 291.8542 319.8871 454.2757 465.8136 724.9461 778.9629 838.6561 913.3557 919.7600 956.8385 959.6323 1012.4783 1096.8779 1107.1604 1128.1822 1161.6966 1196.4234 1238.3106 1277.5352 1305.0625 1378.0997 1387.8522 1406.9516 1468.1600 1468.5210 1478.0632 1481.6721 1490.2544 2972.6259 2975.5934 2988.6671 3055.2976 3060.9131 3064.2852 3072.2069 3077.1312 3087.7072 3162.5803
redmass: 3.1187 2.2295 1.1833 1.1104 2.4496 2.0869 3.0520 2.9908 3.8512 2.5788 3.8394 1.8027 1.2198 1.3205 1.3611 1.1962 1.3018 1.3546 2.2073 1.9420 2.0865 1.5448 1.4117 1.3842 1.2042 1.4743 1.5220 1.0485 1.0471 1.1739 1.0606 1.0903 1.0357 1.0368 1.0837 1.0638 1.0796 1.0990 1.0980 1.0994 1.0999 1.1185
irintensity: 4.2957 5.0520 0.7067 0.0772 1.4434 0.0843 3.0429 6.3374 5.8584 21.3432 23.9839 1.9096 6.6616 12.8938 5.6680 0.4858 2.4685 6.5257 2.0996 3.5401 6.7072 3.5131 5.6584 0.7511 19.7562 4.6943 10.4515 0.5845 6.3097 1.8793 16.7746 20.9946 31.2946 24.8768 11.6941 24.6801 15.1982 10.3650 80.4938 51.1140 30.4265 35.0213
temp: 298.150 k
press: 1.00000 atm
elementType: 8 6 6 6 6 6 1 1 1 1 1 1 1 1 1 1
symmnumber: 1
zpe: 364448.2 jmol-1
zpe.correction: 0.138811 hartree
zpe.thermalcorrener: 0.146069 hartree
zpe.thermalcorrenthalpy: 0.147013 hartree
zpe.thermalcorrgfe: 0.107993 hartree
zpe.sumelectzpe: -271.203276 hartree
zpe.sumelectthermal: -271.196018 hartree
zpe.sumelectthermalent: -271.195074 hartree
zpe.sumelectthermalfe: -271.234094 hartree
dipole: -1.2641 -2.1230 0.2691
dipole: 2.4854
quadrupole: -39.4255 -39.7449 -36.3311
quadrupole: -4.8061 0.5628 0.5470
quadrupole: -0.9250 -1.2444 2.1694 -4.8061 0.5628 0.5470
hfenergy: -271.3420868 hartree
pointgroup: C01 [X(C5H10O1)]
dipole: -0.4770888 0.8483666 -0.0940432 debye
dipolederiv: -0.5061485 0.1658389 0.0292588 0.1987458 -0.5960857 0.0485025 0.0245705 0.0496481 -0.343824 0.3913951 -0.0368708 -0.0246894 -0.1362295 0.1605655 -0.0273456 -0.0994532 0.0198291 0.3197579 0.059916 0.0232883 0.0214921 0.0058867 0.1154635 0.0055338 0.0085747 -0.0069532 0.0796533 0.0767439 -0.0371792 -0.0867822 0.0855626 0.2053211 0.0439198 -0.0819355 -0.005442 0.2592409 -0.0247539 0.0454416 -0.0036317 0.0208282 -0.0404047 0.0243142 0.0473768 0.0047773 0.0924338 -0.0120774 -0.0252972 -0.0057468 -0.0163676 -0.0700867 -0.0142711 0.0317743 -0.0049656 0.1023387 -0.012177 0.0124622 -0.0504726 0.0204985 0.0912728 -0.0079879 -0.0127132 0.0170443 -0.1503503 0.0148223 -0.0034353 -0.0812386 -0.007088 0.0301476 -0.0135758 -0.0510352 -0.010498 -0.1518167 -0.0462755 -0.1024734 0.0898093 -0.1038814 0.01021 0.0157622 0.106689 0.0449847 0.0089429 0.0961526 -0.0170562 0.0456407 -0.0528012 0.0055402 -0.0718462 0.0035709 -0.102834 -0.097095 0.0836733 0.0179835 -0.0300358 0.0021846 0.0712087 -0.0316537 -0.074138 0.0345979 -0.1638091 -0.1406125 0.0386968 0.102459 0.0126651 0.0824049 0.0197204 0.1156192 -0.0025431 0.0281622 0.0321206 -0.1257697 -0.0411731 -0.0848406 -0.129792 -0.0347183 -0.035944 -0.0472023 0.0780622 0.0746979 -0.0261524 -0.0393985 -0.0035903 0.071329 0.0327262 -0.0796617 -0.0330341 -0.1652662 -0.1351196 -0.0497948 0.1101351 -0.0199571 0.079523 -0.0204975 0.1269151 0.0051712 0.0163784 0.0476428 0.120318 -0.0356262 0.0783843 -0.0866174 0.0314171 -0.0302098 0.0374195 0.087191 unknown
polarizability: 63.8435385|2.7891095|54.6435142|1.8826594|0.8510065|48.2866997 unknown
InChI: InChI=1S/C5H10O/c1-4(2)5-3-6-5/h4-5H,3H2,1-2H3
charge 0 multiplicity 1
16 atoms
O  1.613165 -0.865777 0.014334
C  0.528654 0.069077 -0.480611
C  -0.783203 0.055324 0.291587
C  1.789499 0.634732 0.09537
C  -1.604433 1.323598 -0.047198
C  -1.570935 -1.23968 -0.015199
H  0.427012 0.055437 -1.577641
H  -0.533518 0.06552 1.371904
H  2.562178 1.045113 -0.566761
H  1.773619 1.039498 1.116232
H  -1.847229 1.359502 -1.126774
H  -2.558982 1.329515 0.509725
H  -1.052551 2.246816 0.208918
H  -1.845098 -1.290288 -1.086775
H  -2.505119 -1.282719 0.574158
H  -0.964958 -2.130369 0.22723
