program: Gaussian 09
title: 000102604
version: EM64L-G09RevD.01
frameworkgroup: C1[X(C13H24O)]
method: RPBEPBE
basis: SDD
operation: Freq
keyword: #pfreq=noraman
keyword: PBEPBE/SDD
title: #p freq=noraman PBEPBE/SDD
converged: YES YES NO NO
title: Mulliken charges:
elementType: O C C C C C C C C C C C C C H H H H H H H H H H H H H H H H H H H H H H H H
charge: -0.212258 -0.015569 -0.403864 -0.405041 -0.396915 -0.746794 -0.455944 -0.492954 -0.319365 0.217183 0.371894 -0.770471 -0.785274 -0.793270 0.189765 0.184832 0.201473 0.194078 0.219199 0.222032 0.234738 0.213631 0.209750 0.217127 0.191826 0.209725 0.231751 0.227135 0.213793 0.255238 0.230920 0.239447 0.213506 0.216061 0.226954 0.222313 0.216845 0.226502
chargesum: 0.00000
title: Mulliken charges with hydrogens summed into heavy atoms:
elementType: O C C C C C C C C C C C C C
charge: -0.212258 0.174196 -0.017559 0.008236 0.059855 -0.106286 -0.054392 -0.034068 -0.105573 0.217183 0.371894 -0.044866 -0.128754 -0.127610
polarizability: 1.58457466e+02 6.20619756e+00 1.57646413e+02 -8.31309797e+00 -4.44334331e+00 1.17421291e+02
1716.lowfreq: -22.4909 -9.8409 -0.0006 -0.0004 0.0005 2.7278 13.0737 23.2554 26.1264
frequency: 10.7231 22.3257 25.7028 44.2722 70.7363 78.3131 86.0472 94.3345 102.2333 119.7748 149.6254 177.9536 202.0965 221.5105 228.2901 278.8168 293.0908 301.6354 370.0687 380.4718 412.1517 417.0208 461.4146 472.9855 536.6134 546.6050 584.0349 714.0278 750.4323 769.5797 797.9487 805.8794 832.5283 855.1685 926.0075 934.6401 945.4974 946.9936 953.8492 989.3451 993.3721 1010.1226 1016.6801 1040.6331 1063.3460 1081.2830 1087.0838 1114.8628 1124.7588 1145.7325 1150.8742 1171.5815 1185.1716 1228.3905 1244.1067 1259.2746 1267.0263 1272.0184 1288.4173 1308.4995 1325.6119 1342.2548 1345.1215 1357.4544 1363.3402 1368.0304 1386.1244 1387.6816 1398.0210 1427.5567 1443.8057 1454.4292 1456.2451 1456.7013 1461.4200 1466.9340 1470.5856 1472.8673 1476.1976 1476.9211 1485.3612 1486.2507 1635.2406 1695.5740 2936.7323 2947.3941 2951.1156 2955.2465 2959.1504 2963.7110 2967.0669 2971.0067 2979.6147 2995.0171 2998.3751 3000.3704 3015.7080 3026.3173 3031.8057 3041.3484 3059.8656 3063.6825 3065.9412 3066.2502 3068.2191 3078.0594 3092.1222 3118.9849
redmass: 4.1662 3.6149 3.0513 3.0696 1.7393 2.3392 2.3898 2.1063 1.5444 1.0860 2.0956 1.2384 2.2887 1.0866 2.7688 3.0486 3.5008 2.4289 2.1248 2.7502 2.5546 2.4728 2.1076 2.2928 2.5419 2.5318 3.4817 1.1458 1.5743 2.4901 1.8146 1.6347 1.9534 1.9392 1.4819 1.7577 1.4685 1.5963 1.5764 2.0408 1.2474 1.6653 1.9965 2.5593 2.3746 1.6698 1.6147 2.2150 2.0031 1.5489 2.0606 2.0287 1.6027 2.1253 1.4166 1.3766 1.2241 1.1765 1.0878 1.4201 1.5277 1.5426 1.5795 1.4117 1.4998 1.2420 1.2152 1.3144 1.2413 1.0905 1.0664 1.0544 1.0609 1.0641 1.0663 1.0739 1.0495 1.0731 1.0669 1.0674 1.0636 1.0859 7.7585 6.4639 1.0768 1.0620 1.0655 1.0372 1.0646 1.0389 1.0576 1.0404 1.0382 1.0920 1.0714 1.0914 1.0947 1.0970 1.0965 1.0960 1.1019 1.0992 1.0943 1.0936 1.0990 1.0968 1.0957 1.1004
irintensity: 2.4846 2.9771 1.1847 0.1154 0.4685 0.3212 0.8115 2.0031 0.5196 0.1348 0.1675 1.2067 0.5683 0.0882 2.3614 1.6330 1.7583 0.6100 0.5490 2.7908 4.3759 0.5137 0.6857 1.4870 15.1079 5.6598 0.5510 8.3757 1.7892 1.1860 2.2963 0.7459 10.2954 7.5295 1.5700 10.3208 2.2296 0.7491 1.3726 2.1725 5.1424 2.2413 3.2049 0.3602 0.6271 3.5379 7.1679 3.6679 12.5360 17.5128 1.5445 33.7801 2.9835 17.9431 40.8242 17.2984 3.5011 3.4029 1.7502 6.1281 8.0984 20.6233 4.8930 2.6155 2.0430 64.1810 17.2439 23.7347 9.4661 21.9373 20.4150 1.6758 13.2294 4.9368 10.2816 1.6017 31.5841 8.0630 1.1183 16.3300 21.6433 1.6585 96.6320 2.2053 17.4586 17.0342 17.2084 45.1460 78.2888 47.6329 28.0351 37.5173 5.1319 26.6425 11.2044 25.5503 19.6461 12.7739 44.2528 30.1992 49.2083 56.0131 11.6888 32.7788 64.9385 59.2610 43.4808 14.3460
temp: 298.150 k
press: 1.00000 atm
elementType: 8 6 6 6 6 6 6 6 6 6 6 6 6 6 1 1 1 1 1 1 1 1 1 1 1 1 1 1 1 1 1 1 1 1 1 1 1 1
symmnumber: 1
zpe: 884978.3 jmol-1
zpe.correction: 0.337070 hartree
zpe.thermalcorrener: 0.355850 hartree
zpe.thermalcorrenthalpy: 0.356794 hartree
zpe.thermalcorrgfe: 0.286264 hartree
zpe.sumelectzpe: -583.845022 hartree
zpe.sumelectthermal: -583.826243 hartree
zpe.sumelectthermalent: -583.825299 hartree
zpe.sumelectthermalfe: -583.895829 hartree
dipole: 1.2091 0.9376 -2.4390
dipole: 2.8792
quadrupole: -78.7744 -88.8353 -93.2532
quadrupole: 2.1408 -8.3210 4.2173
quadrupole: 8.1799 -1.8810 -6.2989 2.1408 -8.3210 4.2173
hfenergy: -584.1820926 hartree
pointgroup: C01 [X(C13H24O1)]
dipole: -0.4197589 0.4183777 0.9653665 debye
polarizability: 157.0094574|-6.1610648|158.8016241|-8.8029713|4.8073412|117.7140889 unknown
InChI: InChI=1S/C13H24O/c1-11(2)7-5-8-12(3)9-6-10-13(4)14/h7,12H,5-6,8-10H2,1-4H3
charge 0 multiplicity 1
38 atoms
O  -3.135231 -1.526071 -1.183425
C  0.260193 2.423399 0.151465
C  -0.933697 1.691255 0.832212
C  1.355402 1.460464 -0.382753
C  -1.694278 0.686544 -0.063775
C  -0.214149 3.377285 -0.97233
C  1.988044 0.543769 0.701308
C  -2.891251 0.052987 0.66967
C  3.220896 -0.179242 0.196765
C  -3.613808 -1.039954 -0.124108
C  3.383965 -1.515131 -0.031285
C  -4.956091 -1.509783 0.43137
C  4.702848 -2.059366 -0.560279
C  2.315707 -2.569515 0.202345
H  0.73404 3.047995 0.941088
H  -1.645368 2.460926 1.19956
H  -0.567962 1.1594 1.734862
H  2.159624 2.070267 -0.843784
H  0.945991 0.83032 -1.196989
H  -2.059304 1.185056 -0.981446
H  -1.021286 -0.121275 -0.405439
H  0.626024 3.99037 -1.348652
H  -1.000853 4.066283 -0.610446
H  -0.623895 2.816269 -1.832792
H  2.268953 1.177648 1.570031
H  1.233766 -0.174358 1.071189
H  -2.555612 -0.406821 1.625939
H  -3.632828 0.82353 0.96784
H  4.075665 0.479096 -0.029696
H  -5.233307 -2.48116 -0.007458
H  -4.937491 -1.581409 1.533935
H  -5.738769 -0.771705 0.166107
H  5.133643 -2.806624 0.136217
H  4.559337 -2.577696 -1.529718
H  5.447984 -1.257968 -0.706658
H  2.112164 -3.129347 -0.732006
H  2.657514 -3.314295 0.948871
H  1.36052 -2.147842 0.554864
