program: Gaussian 09
title: 000102603
version: EM64L-G09RevD.01
frameworkgroup: C1[X(C9H12O)]
method: RPBEPBE
basis: SDD
operation: Freq
keyword: #pfreq=noraman
keyword: PBEPBE/SDD
title: #p freq=noraman PBEPBE/SDD
converged: YES YES NO NO
title: Mulliken charges:
elementType: O C C C C C C C C C H H H H H H H H H H H H
charge: -0.250382 0.340441 0.122491 -0.549282 -0.506158 -0.362863 -0.236801 0.062826 -0.685973 -0.765590 0.244525 0.241377 0.255033 0.201871 0.253125 0.241499 0.252247 0.208383 0.219481 0.233851 0.224501 0.255397
chargesum: 0.00000
title: Mulliken charges with hydrogens summed into heavy atoms:
elementType: O C C C C C C C C C
charge: -0.250382 0.340441 0.122491 -0.063379 -0.049253 -0.109738 0.004698 0.062826 -0.005861 -0.051841
polarizability: 1.21287058e+02 3.32671984e+00 1.18569006e+02 -4.17083585e+00 3.82800465e+00 6.16215477e+01
1716.lowfreq: -12.0394 -7.7687 -0.0008 -0.0006 0.0002 4.4920 44.1687 58.6003 96.3236
frequency: 43.9899 58.4835 96.2577 142.2585 163.3308 190.1548 221.3124 308.0379 329.5909 380.1664 405.3423 459.8560 561.9212 610.9085 622.6891 679.6503 742.4252 786.1117 826.2133 894.1374 905.1782 943.9927 957.5082 976.2586 1006.1981 1017.5425 1050.5248 1061.0733 1085.9870 1090.2776 1150.4175 1206.5536 1223.9667 1284.6035 1303.9632 1326.2234 1365.2095 1372.9890 1387.0877 1394.2408 1442.3842 1458.9421 1461.0027 1473.0963 1485.2080 1510.8825 1555.5697 1594.7322 2972.8349 2980.1571 2984.6827 2992.2509 3016.0370 3063.9563 3064.4257 3083.2486 3099.7577 3120.6982 3159.4586 3193.5107
redmass: 2.4461 2.3042 1.4487 2.4719 3.6159 1.9598 1.4512 2.3775 2.5807 2.1309 4.0095 3.4372 2.7694 3.8608 3.5108 1.7989 1.8303 1.2436 4.2430 2.1590 2.6649 1.2851 2.0531 1.8912 2.1605 1.7737 1.7851 1.7751 1.3632 1.1637 2.0979 1.8507 1.9605 1.3997 1.5849 2.9993 1.2617 1.5713 1.6082 1.2276 1.1482 1.1164 1.0524 1.0536 1.0804 4.8309 5.6675 6.9481 1.0601 1.0387 1.0350 1.0618 1.0963 1.0968 1.0982 1.1000 1.1015 1.0992 1.0885 1.1058
irintensity: 1.6427 4.1272 1.5674 1.0111 0.1167 2.1567 0.9602 3.1486 4.7686 4.4604 1.7446 4.5686 7.0711 10.7404 7.4798 23.9123 23.0230 1.3567 22.3924 4.3619 25.3853 3.4758 6.0037 26.9621 0.6399 5.4753 20.9029 2.2678 2.4350 0.7101 4.9304 27.9626 61.9875 15.3270 18.1031 38.5736 51.6158 6.0285 24.2948 19.0118 59.8680 20.4527 17.0463 5.0958 22.4239 114.1433 104.1074 73.5924 4.1879 12.1568 40.2155 37.3642 6.7942 18.2216 5.2186 36.3824 27.4913 15.5726 7.3860 14.4437
temp: 298.150 k
press: 1.00000 atm
elementType: 8 6 6 6 6 6 6 6 6 6 1 1 1 1 1 1 1 1 1 1 1 1
symmnumber: 1
zpe: 480572.6 jmol-1
zpe.correction: 0.183040 hartree
zpe.thermalcorrener: 0.193778 hartree
zpe.thermalcorrenthalpy: 0.194722 hartree
zpe.thermalcorrgfe: 0.146197 hartree
zpe.sumelectzpe: -424.602600 hartree
zpe.sumelectthermal: -424.591863 hartree
zpe.sumelectthermalent: -424.590919 hartree
zpe.sumelectthermalfe: -424.639444 hartree
dipole: 0.1108 3.6854 0.3428
dipole: 3.7030
quadrupole: -53.5785 -62.8502 -61.2734
quadrupole: -4.1937 -1.4930 0.2703
quadrupole: 5.6555 -3.6162 -2.0394 -4.1937 -1.4930 0.2703
hfenergy: -424.7856408 hartree
pointgroup: C01 [X(C9H12O1)]
dipole: 0.3960278 -1.3867168 -0.2064788 debye
dipolederiv: -0.6795393 0.0373021 0.0160944 0.3560151 -1.0171544 -0.0934107 0.0752788 -0.0976893 -0.327049 0.3724417 -0.1842066 -0.0491318 0.2160666 0.5219414 0.047993 0.0149119 0.1212663 -0.0236176 -1.078411 0.4538618 0.0775075 0.1938959 -0.116192 0.0356584 -0.0073693 0.035803 -0.1160244 -0.2291757 -0.1308144 -0.0487055 -0.0999997 -0.1301559 -0.0683046 -0.0356862 -0.0919753 0.151373 0.1201261 -0.0349749 0.0579876 -0.1532404 -0.1633199 0.0231866 0.1913833 0.0887945 0.0547387 0.1665885 -0.088017 0.0164383 0.0099737 -0.4123344 -0.0371902 0.0311478 -0.066542 -0.1768577 0.02322 0.2184364 0.0660203 0.092315 0.0191674 0.0609933 0.0445558 0.0765093 -0.1955424 1.6141831 -0.1839096 -0.0399713 -0.3642904 1.0259637 0.1147769 -0.0630852 0.1221102 0.1133013 0.0287272 -0.0174799 -0.0235627 -0.0211103 0.0731781 0.0362786 -0.1469807 -0.0657105 0.0319623 -0.4364791 -0.1686729 -0.0150283 -0.3000849 -0.0985904 -0.0129789 -0.0219539 -0.0115354 0.0557093 0.0752407 -0.0173361 -0.081218 -0.0054534 0.1035782 -0.02168 -0.0871692 -0.0602837 -0.0325964 0.0510213 -0.067131 0.0717401 -0.0585841 0.0518919 0.0574864 0.0843059 0.0882279 0.0468734 0.0271283 0.0564946 0.0985839 0.0011319 0.0422373 -0.0369638 0.0330176 -0.0241389 0.0126711 -0.1108888 -0.0212962 -0.1424411 0.018919 0.0353778 0.0468031 -0.1160846 0.0114907 -0.0021685 -0.1045992 0.0127674 -0.0218971 -0.0181684 0.0993001 -0.0221667 -0.0275278 -0.0223044 0.1606322 0.0596868 0.0680684 0.0053385 0.0708994 -0.0549187 -0.040877 0.0020891 -0.0415377 0.1581704 -0.0424187 0.0599737 -0.1113284 0.0077369 0.0998182 0.0137717 -0.0697181 0.0017328 0.0234325 -0.0170288 0.044276 0.1194614 0.1055685 0.0350289 -0.0754062 0.0991089 -0.027013 -0.0359207 0.0481356 -0.1094376 -0.0068001 -0.1445254 -0.1750797 -0.0272149 0.0100382 -0.0301254 0.0584219 0.0709916 0.0017922 -0.0241148 -0.0297852 0.017927 0.1072348 0.0214933 0.106064 -0.0256606 0.072565 0.0060124 0.0410317 -0.0204331 0.0318699 -0.1100816 -0.02323 -0.1091125 -0.0499865 -0.0315152 0.0642913 -0.0060046 0.1431535 0.0104654 0.0020918 -0.0085255 -0.0040303 0.1181376 unknown
polarizability: 122.8684928|-2.0925825|116.6645298|0.5213671|7.031903|61.9445895 unknown
InChI: InChI=1S/C9H12O/c1-3-8-5-4-6-9(8)7(2)10/h4-5H,3,6H2,1-2H3
charge 0 multiplicity 1
22 atoms
O  -1.543331 1.705817 0.39885
C  0.951443 0.045215 0.329566
C  -0.363916 -0.3789 0.116675
C  -0.349551 -1.866509 -0.211075
C  1.443023 1.432029 0.66414
C  1.848462 -1.109166 0.150527
C  1.116989 -2.230912 -0.163079
C  -1.581351 0.442776 0.214907
C  1.66132 2.289532 -0.615655
C  -2.931702 -0.271106 0.105317
H  -0.782853 -2.080909 -1.210479
H  -0.942143 -2.464514 0.511804
H  0.69764 1.948046 1.293043
H  2.395508 1.360904 1.224257
H  2.935162 -1.053271 0.261201
H  1.503788 -3.234943 -0.354535
H  0.700143 2.437331 -1.136427
H  2.372427 1.807196 -1.31104
H  2.062096 3.282794 -0.344356
H  -3.084486 -0.949246 0.966922
H  -2.992926 -0.886517 -0.811519
H  -3.737142 0.479253 0.095554
