program: Gaussian 09
title: 000102549
version: EM64L-G09RevD.01
frameworkgroup: C1[X(C10H18O2)]
method: RPBEPBE
basis: SDD
operation: Freq
keyword: #pfreq=noraman
keyword: PBEPBE/SDD
title: #p freq=noraman PBEPBE/SDD
converged: YES YES NO NO
title: Mulliken charges:
elementType: O O C C C C C C C C C C H H H H H H H H H H H H H H H H H H
charge: -0.425493 -0.436860 -0.376053 -0.365304 -0.354426 -0.362194 -0.171228 -0.145867 -0.688096 -0.688339 -0.021415 -0.058364 0.190956 0.221192 0.219572 0.217628 0.198022 0.217370 0.214255 0.193504 0.246785 0.211330 0.211123 0.220070 0.211485 0.214034 0.211781 0.216984 0.333052 0.344495
chargesum: 0.00000
title: Mulliken charges with hydrogens summed into heavy atoms:
elementType: O O C C C C C C C C C C
charge: -0.092441 -0.092365 0.036095 0.071896 0.060966 0.045565 0.075558 0.065463 -0.045418 -0.045539 -0.021415 -0.058364
polarizability: 1.43895672e+02 1.06325262e+00 1.16866388e+02 -3.69617135e-01 -4.01225468e-01 8.97337393e+01
1716.lowfreq: -9.7240 -5.1386 -0.0010 -0.0007 -0.0004 3.7905 14.0877 30.4646 65.2478
frequency: 12.2068 30.3954 65.0806 73.3871 81.1933 118.5328 120.5865 144.2923 166.5984 200.3669 204.9005 236.1659 237.7066 295.4206 299.4276 330.3900 365.7871 380.3355 399.1986 498.5542 520.8426 553.2075 569.4004 694.2845 751.3325 759.5943 861.2765 888.6547 892.6588 897.1596 908.3654 943.1248 980.2322 1018.5792 1051.5121 1070.7438 1088.8682 1092.6262 1103.4941 1116.0426 1160.7519 1205.8334 1211.1348 1223.9387 1241.2005 1277.4096 1284.5193 1285.4502 1286.5723 1303.0534 1311.8195 1347.7958 1349.7726 1353.6167 1364.0260 1390.1491 1390.7495 1463.1928 1466.3028 1475.3263 1475.9182 1476.9716 1478.2817 1487.1546 1488.4978 2253.7821 2929.1432 2969.5767 2971.1406 2975.0403 2975.2711 2979.3902 3000.3920 3015.8471 3018.4205 3029.2145 3051.7553 3063.0947 3072.7368 3075.1057 3075.7694 3076.1066 3544.8041 3553.0682
redmass: 4.2363 3.5332 2.5025 2.3558 1.7433 3.1305 2.9947 2.7166 3.7819 3.2689 3.7464 1.1094 1.1265 1.1291 1.1839 3.4304 4.1009 4.7257 3.9229 5.4029 3.3184 3.0647 7.2101 2.2732 1.1084 1.2127 1.5439 1.4215 1.9039 1.9045 2.7512 4.1673 2.4140 2.9763 2.6357 2.2689 1.6661 1.6127 2.1285 1.9451 2.4001 1.3764 1.3821 1.3204 1.2239 1.1732 1.2228 1.2442 1.1600 1.2528 1.2750 1.5255 1.5072 1.6494 1.2152 1.2097 1.2097 1.0775 1.0753 1.0555 1.0553 1.0431 1.0424 1.0796 1.0836 11.8401 1.0819 1.0588 1.0581 1.0386 1.0373 1.0600 1.0601 1.0996 1.0968 1.0865 1.1010 1.1025 1.1012 1.1007 1.1002 1.0998 1.0662 1.0663
irintensity: 0.2739 0.1205 0.1767 0.0351 0.0739 0.3906 1.9790 0.9863 0.3787 3.3206 2.6546 0.5874 0.2069 246.2154 54.5296 9.0399 1.7452 15.6233 16.1502 2.1891 19.5563 11.5074 11.7015 5.5778 19.3466 1.2342 3.4935 24.4363 38.2799 20.9304 50.3361 51.7718 29.0410 38.5210 0.8777 1.8006 6.6496 5.3487 5.6745 14.8494 21.4393 22.5096 11.7747 11.1147 17.8803 4.5781 4.5398 3.6211 4.3710 14.0571 11.0493 42.4951 28.7508 4.9406 42.2764 11.2406 11.8387 1.5420 2.5254 2.0051 2.6747 20.0962 5.9200 21.0147 5.8625 2.2064 40.1338 32.3812 4.3904 18.2677 41.4980 62.4963 32.0843 11.8521 3.5641 7.2933 24.0230 0.6736 104.2737 60.6601 61.0026 56.9692 8.1730 7.4752
temp: 298.150 k
press: 1.00000 atm
elementType: 8 8 6 6 6 6 6 6 6 6 6 6 1 1 1 1 1 1 1 1 1 1 1 1 1 1 1 1 1 1
symmnumber: 1
zpe: 678591.4 jmol-1
zpe.correction: 0.258462 hartree
zpe.thermalcorrener: 0.274355 hartree
zpe.thermalcorrenthalpy: 0.275299 hartree
zpe.thermalcorrgfe: 0.213175 hartree
zpe.sumelectzpe: -541.255963 hartree
zpe.sumelectthermal: -541.240070 hartree
zpe.sumelectthermalent: -541.239126 hartree
zpe.sumelectthermalfe: -541.301249 hartree
dipole: -0.4465 1.7947 1.7192
dipole: 2.5251
quadrupole: -81.3028 -77.2589 -71.9396
quadrupole: -2.7008 3.1859 -3.7425
quadrupole: -4.4690 -0.4251 4.8942 -2.7008 3.1859 -3.7425
hfenergy: -541.5144243 hartree
pointgroup: C01 [X(C10H18O2)]
dipole: -0.1806569 0.7143892 0.6662719 debye
polarizability: 143.7330129|1.9176698|116.935506|-1.8840389|-1.0562405|89.8272806 unknown
InChI: InChI=1S/C10H18O2/c1-3-5-9(11)7-8-10(12)6-4-2/h9-12H,3-6H2,1-2H3
charge 0 multiplicity 1
30 atoms
O  -2.637091 -2.324405 0.686963
O  2.710466 -2.117697 -0.639468
C  -2.763209 0.150449 0.348781
C  2.720129 0.270877 -0.295501
C  -2.390741 1.357746 -0.541234
C  2.327593 1.49268 0.562499
C  -2.089781 -1.178044 -0.082514
C  2.090304 -1.0533 0.188339
C  -3.120133 2.648553 -0.110592
C  2.981682 2.794659 0.051622
C  -0.616039 -1.122931 0.003453
C  0.616152 -1.073485 0.09146
H  -2.492642 0.368188 1.40253
H  -3.856729 -0.01994 0.319413
H  3.817877 0.129435 -0.278584
H  2.428096 0.429977 -1.350197
H  -2.639977 1.125606 -1.596583
H  -1.295316 1.51782 -0.506043
H  1.225142 1.605078 0.562006
H  2.625996 1.318324 1.616555
H  -2.387598 -1.416595 -1.120002
H  2.367381 -1.215036 1.254637
H  -2.865015 2.921084 0.930882
H  -2.844041 3.499692 -0.759197
H  -4.217943 2.523883 -0.165553
H  2.675662 3.009105 -0.989496
H  4.085161 2.71839 0.067108
H  2.693964 3.661149 0.674516
H  -2.339128 -2.232362 1.628941
H  2.202178 -2.958902 -0.506138
