program: Gaussian 09
title: 000102532
version: EM64L-G09RevD.01
frameworkgroup: C1[X(C15H28O2)]
method: RPBEPBE
basis: SDD
operation: Freq
keyword: #pfreq=noraman
keyword: PBEPBE/SDD
title: #p freq=noraman PBEPBE/SDD
converged: YES YES NO NO
title: Mulliken charges:
elementType: O O C C C C C C C C C C C C C C C H H H H H H H H H H H H H H H H H H H H H H H H H H H H
charge: -0.301112 -0.284075 0.329820 -0.445810 -0.447881 -0.377873 -0.379288 -0.011491 -0.337416 -0.389312 -0.389651 -0.386217 -0.385345 -0.383913 -0.384288 -0.390944 -0.705511 0.200972 0.218638 0.200994 0.217624 0.225497 0.188545 0.223720 0.189298 0.208253 0.192203 0.224778 0.192063 0.192791 0.192208 0.192605 0.191563 0.201085 0.191485 0.200829 0.200104 0.188014 0.199925 0.188255 0.190135 0.190312 0.222406 0.238167 0.207838
chargesum: 0.00000
title: Mulliken charges with hydrogens summed into heavy atoms:
elementType: O O C C C C C C C C C C C C C C C
charge: -0.301112 -0.284075 0.329820 -0.026200 -0.029263 0.036169 0.033730 0.196762 0.079564 -0.004458 -0.004837 0.006431 0.006969 0.004205 0.003892 -0.010498 -0.037100
polarizability: 1.98459248e+02 -5.33804201e-01 1.61098605e+02 -2.20362494e-01 2.45092720e-02 1.34645626e+02
1716.lowfreq: -17.0551 -5.9092 -0.0004 -0.0004 -0.0002 10.8800 17.0667 36.6554 62.1996
frequency: 16.7202 36.3634 62.0169 70.9016 110.3870 153.2303 171.2934 187.7016 202.2295 209.3901 220.3121 232.7617 255.9823 258.1970 272.9554 290.5606 317.5400 334.4679 339.9819 365.1361 384.3488 427.1702 451.9652 478.4009 499.8624 510.6160 573.2800 666.4759 688.4154 722.4602 733.7765 738.7518 765.6133 792.4322 797.1926 818.7549 840.1878 846.2266 874.6093 888.4324 903.0342 934.6934 946.3845 954.5105 957.6493 975.8929 980.2250 1011.0324 1026.6989 1038.7992 1060.4819 1070.4641 1074.4952 1082.9052 1093.7560 1109.4591 1115.5773 1122.0073 1138.6460 1146.7174 1158.6780 1172.4805 1185.0719 1191.5672 1212.5385 1224.5831 1248.3734 1257.2750 1266.8757 1276.4217 1288.0122 1290.1292 1294.3332 1298.8544 1302.8964 1308.6965 1316.0133 1323.8297 1334.7367 1339.1154 1345.3486 1347.8628 1355.2589 1356.8922 1358.7653 1362.8859 1391.3894 1450.8142 1457.4507 1459.3776 1460.9254 1463.8333 1466.1410 1467.6711 1468.2458 1469.5008 1476.8360 1478.5629 1478.9526 1487.0905 1494.3882 2956.7540 2958.0263 2960.8008 2961.2305 2970.2189 2971.2759 2974.9751 2976.3119 2980.9631 2990.1978 2992.7664 2994.8612 2997.9454 3000.7970 3005.3275 3007.8144 3015.8914 3021.5309 3026.6327 3035.2975 3036.9145 3040.9509 3042.0124 3060.1528 3067.0069 3082.0039 3088.2361 3099.3393
redmass: 3.5289 3.3002 2.8804 3.5987 2.6377 2.8860 3.2437 2.2395 2.1132 1.4268 2.5187 1.9019 2.5303 1.9398 2.6622 1.7765 2.0457 2.2358 3.7682 2.2910 2.3513 2.9181 2.4298 3.1333 2.3702 2.6317 3.6349 4.8278 1.2703 1.2692 2.3235 1.8700 1.5222 2.1611 2.0966 1.7260 2.2731 2.9046 2.5375 2.0778 2.3018 1.8787 1.8195 1.6912 1.7704 2.7125 2.2224 2.2972 1.8910 1.9331 1.9508 1.8758 2.3069 2.2843 1.9397 2.2180 2.4359 1.6508 1.7150 1.8868 1.6141 1.4984 1.3374 1.3623 1.3942 1.6010 1.4886 1.2645 1.3972 1.3342 1.2451 1.1556 1.2690 1.2729 1.1832 1.2302 1.2901 1.1957 1.3889 1.3877 1.4165 1.4749 1.4653 1.4401 1.4522 1.5464 1.2639 1.0766 1.0823 1.0598 1.0852 1.0800 1.0821 1.0848 1.0835 1.0840 1.0954 1.0498 1.0909 1.0748 1.0919 1.0780 1.0602 1.0599 1.0603 1.0728 1.0620 1.0616 1.0626 1.0616 1.0362 1.0635 1.0650 1.0622 1.0621 1.0974 1.0973 1.0971 1.0957 1.0950 1.1033 1.0991 1.1009 1.0972 1.1019 1.1011 1.0989 1.0989 1.1003
irintensity: 2.9756 0.7901 0.3469 1.0281 1.2331 0.6665 0.1469 0.0076 1.4584 1.4640 0.4887 0.3586 0.1842 0.0339 0.7809 0.6399 0.2458 0.3345 0.4934 0.6544 0.0510 5.4542 1.5491 8.9660 0.6527 10.7781 5.2459 4.0357 7.4440 23.0721 12.7250 14.1162 0.2118 10.7250 0.2021 5.8091 14.2756 22.8071 0.2876 8.1082 17.0883 6.8588 6.4538 0.9923 1.8956 38.8021 11.3860 58.4216 23.1405 19.9030 30.4411 5.0669 61.1147 1.3652 14.0189 4.4591 0.2318 4.2245 1.3354 5.7511 3.7849 16.9171 7.3037 1.2319 28.7542 3.9376 27.4349 5.6328 14.4702 0.9266 1.1348 4.1883 3.4935 20.2127 6.0367 5.2012 14.3110 2.6896 1.8066 2.5045 0.8723 2.9238 1.3845 1.3898 2.6070 5.9026 21.0352 3.7542 4.7963 4.7371 11.8905 7.5068 1.3404 7.3380 4.2325 9.7788 2.8330 8.7014 4.5998 0.7662 55.7856 38.0006 31.4315 76.0611 3.3929 80.3047 37.9533 13.7741 57.0204 20.1929 28.8923 3.6310 0.2277 12.9000 16.5839 30.2408 7.5699 15.0814 2.5746 152.6109 99.7107 5.1682 154.3442 59.5667 86.0091 49.0353 8.4767 51.1858 31.6107
temp: 298.150 k
press: 1.00000 atm
elementType: 8 8 6 6 6 6 6 6 6 6 6 6 6 6 6 6 6 1 1 1 1 1 1 1 1 1 1 1 1 1 1 1 1 1 1 1 1 1 1 1 1 1 1 1 1
symmnumber: 1
zpe: 1065008.0 jmol-1
zpe.correction: 0.405640 hartree
zpe.thermalcorrener: 0.423777 hartree
zpe.thermalcorrenthalpy: 0.424721 hartree
zpe.thermalcorrgfe: 0.359512 hartree
zpe.sumelectzpe: -737.428547 hartree
zpe.sumelectthermal: -737.410410 hartree
zpe.sumelectthermalent: -737.409466 hartree
zpe.sumelectthermalfe: -737.474675 hartree
dipole: -1.0632 0.0542 -0.1390
dipole: 1.0736
quadrupole: -94.2443 -106.2937 -110.4392
quadrupole: 0.7224 -0.3730 2.8401
quadrupole: 9.4147 -2.6346 -6.7801 0.7224 -0.3730 2.8401
hfenergy: -737.8341869 hartree
pointgroup: C01 [X(C15H28O2)]
dipole: -0.4174182 -0.0318419 0.0562092 debye
polarizability: 198.4082813|1.4882666|161.1502357|-0.0054417|-0.0554181|134.6449618 unknown
InChI: InChI=1S/C15H28O2/c1-14-13-16-15(17-14)11-9-7-5-3-2-4-6-8-10-12-15/h14H,2-13H2,1H3
charge 0 multiplicity 1
45 atoms
O  -2.392575 -0.404727 0.83326
O  -2.22915 0.738427 -1.249177
C  -1.410989 0.124506 -0.154691
C  -0.573226 1.250205 0.482031
C  -0.61414 -1.07158 -0.710265
C  0.338444 2.016806 -0.509686
C  0.10967 -1.919593 0.367057
C  -3.730663 0.144243 0.482815
C  -3.6190 0.290728 -1.046927
C  1.50359 2.772589 0.184108
C  1.276906 -2.770531 -0.200889
C  2.609191 1.842867 0.754908
C  2.514779 -1.939747 -0.636349
C  3.462281 1.140208 -0.333711
C  3.297979 -1.314775 0.548093
C  4.217065 -0.125479 0.157492
C  -4.79826 -0.822174 0.989027
H  0.03017 0.800448 1.291828
H  -1.273602 1.95575 0.968042
H  0.113091 -0.678022 -1.443951
H  -1.317469 -1.709938 -1.277933
H  -0.283212 2.727053 -1.085585
H  0.75971 1.317332 -1.256677
H  -0.631559 -2.57631 0.858876
H  0.501419 -1.262632 1.166872
H  -3.846591 1.145297 0.950008
H  -3.802451 -0.68321 -1.54694
H  -4.275286 1.065837 -1.474829
H  1.092159 3.398441 1.002801
H  1.963276 3.472891 -0.543385
H  0.908146 -3.360272 -1.065415
H  1.593121 -3.50626 0.567025
H  2.134978 1.083037 1.4064
H  3.279251 2.429106 1.415729
H  2.186307 -1.141403 -1.32997
H  3.201286 -2.583331 -1.222857
H  4.197309 1.865989 -0.736908
H  2.816467 0.862302 -1.189262
H  3.912907 -2.104007 1.026714
H  2.586571 -0.978183 1.327114
H  4.916163 -0.457706 -0.637878
H  4.845014 0.146041 1.031376
H  -4.669275 -1.816787 0.52711
H  -4.723424 -0.938075 2.083756
H  -5.809577 -0.44496 0.749641
