program: Gaussian 09
title: 000102468
version: EM64L-G09RevD.01
frameworkgroup: C1[X(C8H16N2O3)]
method: RPBEPBE
basis: SDD
operation: Freq
keyword: #p
keyword: freq=noraman
keyword: PBEPBE/SDD
title: #p freq=noraman PBEPBE/SDD
converged: YES YES NO NO
title: Mulliken charges:
elementType: O O O N N C C C C C C C C H H H H H H H H H H H H H H H H
charge: -0.440481 -0.214096 -0.287573 -0.374827 -0.520970 -0.006821 -0.428983 -0.125172 -0.731686 -0.713670 0.152251 0.208117 -0.522430 0.208262 0.231521 0.192675 0.293159 0.212995 0.254283 0.212077 0.243178 0.202542 0.212557 0.320963 0.248342 0.221361 0.389544 0.272874 0.290009
chargesum: 0.00000
title: Mulliken charges with hydrogens summed into heavy atoms:
elementType: O O O N N C C C C C C C C
charge: -0.050937 -0.214096 -0.287573 -0.053864 0.041912 0.185854 0.010800 0.167987 -0.052332 -0.055393 0.152251 0.208117 -0.052727
polarizability: 1.21513001e+02 3.45910990e+00 1.12802764e+02 -2.21520788e+00 5.99746758e+00 9.59085335e+01
1716.lowfreq: -8.6160 -5.3895 -0.0005 0.0003 0.0006 13.6178 31.1252 33.7982 40.8415
frequency: 30.8995 33.0323 40.7533 62.8424 75.5216 97.6314 120.6120 157.1238 202.2363 219.3300 245.5436 260.9345 274.5217 292.6917 333.4280 350.8090 365.7048 388.5775 510.8286 532.5496 546.2577 584.6104 598.5066 607.2669 670.6284 682.5537 752.2483 789.4550 837.5884 848.4255 892.0199 910.2074 921.3296 952.1978 970.1380 999.8032 1058.2228 1076.7422 1123.2005 1130.5431 1135.1277 1160.0394 1202.5770 1220.0732 1242.8773 1262.8923 1290.4701 1309.6422 1316.1437 1322.1711 1342.7813 1345.0688 1357.2192 1380.9748 1401.0646 1440.3733 1451.4146 1463.1963 1481.9038 1486.5373 1490.7086 1501.5744 1614.3874 1662.9370 1669.3313 2951.0638 2971.0607 2975.4649 2975.7226 2981.2708 3033.4809 3036.4293 3052.8011 3065.2155 3068.8324 3072.2040 3091.9584 3442.5013 3525.4622 3541.2946 3558.5389
redmass: 4.9753 4.0150 2.8696 5.8558 2.6065 3.1101 4.2640 3.4965 2.6290 1.5909 1.1574 1.2692 1.9094 5.3748 2.8970 3.5796 2.1777 2.2932 2.9107 3.4814 2.8008 1.6634 1.5643 1.8947 2.5043 3.0609 2.2621 3.3898 3.1249 2.3584 1.6107 4.1074 1.2270 1.5979 1.8531 2.3275 2.1357 2.8473 1.7670 2.6201 1.4866 2.2747 1.9426 1.7112 1.4366 1.4223 1.6055 1.3982 1.3968 1.4639 1.4016 1.2920 1.2988 1.2181 1.2098 1.0884 1.1051 1.0468 1.1086 1.0555 1.6433 1.0561 6.4631 1.0819 9.1639 1.0795 1.0366 1.0611 1.0526 1.0464 1.0982 1.1009 1.0864 1.0995 1.0996 1.0996 1.0984 1.0457 1.0643 1.0770 1.0954
irintensity: 1.3827 0.9944 0.3572 7.4902 2.0053 0.7460 0.1428 2.6827 12.2854 51.8711 3.6611 10.1773 26.7414 8.9130 1.8980 13.7641 1.3876 5.2081 11.2873 6.5948 4.3002 82.9670 80.4177 111.5023 55.2989 82.6765 262.6455 9.3272 33.2538 19.4670 13.8760 15.1085 3.9189 2.9044 3.7981 2.1583 64.7568 143.1754 22.4450 8.6995 13.0673 17.5095 5.3287 32.0316 25.8653 30.3106 35.5337 2.7422 8.0052 2.2189 0.8888 3.5019 2.5841 23.2130 22.2241 10.7033 30.4916 4.7587 61.9783 4.2191 143.8918 7.4278 130.7947 34.4478 230.8248 19.9556 38.6304 26.6615 43.5328 30.1395 13.5045 22.2836 15.0375 25.8594 38.8744 37.0931 37.3775 1.6994 32.3090 32.0525 2.8240
temp: 298.150 k
press: 1.00000 atm
elementType: 8 8 8 7 7 6 6 6 6 6 6 6 6 1 1 1 1 1 1 1 1 1 1 1 1 1 1 1 1
symmnumber: 1
zpe: 636666.4 jmol-1
zpe.correction: 0.242493 hartree
zpe.thermalcorrener: 0.258187 hartree
zpe.thermalcorrenthalpy: 0.259131 hartree
zpe.thermalcorrgfe: 0.197927 hartree
zpe.sumelectzpe: -648.589299 hartree
zpe.sumelectthermal: -648.573606 hartree
zpe.sumelectthermalent: -648.572661 hartree
zpe.sumelectthermalfe: -648.633866 hartree
dipole: -1.0489 -1.3039 -3.1266
dipole: 3.5463
quadrupole: -91.0227 -70.2313 -81.9162
quadrupole: -2.5234 5.7839 2.5065
quadrupole: -9.9660 10.8254 -0.8594 -2.5234 5.7839 2.5065
hfenergy: -648.8317923 hartree
pointgroup: C01 [X(C8H16N2O3)]
dipole: -0.2763156 0.4451952 1.2930915 debye
polarizability: 117.2170647|-6.6057762|114.7180796|4.8489437|7.0310465|98.2891539 unknown
InChI: InChI=1S/C8H16N2O3/c1-5(2)3-6(8(12)13)10-7(11)4-9/h5-6,10,12H,3-4,9H2,1-2H3
charge 0 multiplicity 1
29 atoms
O  -0.207388 2.676472 1.213032
O  -1.671084 2.862027 -0.581977
O  1.356753 -0.909977 -1.295725
N  0.558418 0.223342 0.57786
N  3.959432 -1.205263 -0.102142
C  -2.19185 -1.551766 0.07468
C  -1.983294 -0.068643 0.498977
C  -0.701342 0.648992 -0.044575
C  -2.177884 -1.73044 -1.463003
C  -1.220477 -2.547787 0.754206
C  -0.915933 2.154632 0.1142
C  1.519768 -0.499304 -0.104492
C  2.79982 -0.828085 0.709537
H  -1.984699 0.005512 1.605451
H  -2.850624 0.51519 0.131721
H  -3.21473 -1.799243 0.433144
H  -0.608383 0.442561 -1.125795
H  -2.855788 -1.011964 -1.96174
H  -1.158693 -1.593256 -1.869045
H  -2.507184 -2.750276 -1.734727
H  -0.204775 -2.467236 0.331811
H  -1.162324 -2.379592 1.846157
H  -1.564743 -3.58585 0.589244
H  0.771972 0.60195 1.503311
H  2.550288 -1.667597 1.389592
H  3.067821 0.029706 1.355991
H  -0.407695 3.646776 1.304504
H  4.337526 -0.419371 -0.643728
H  3.745494 -1.98831 -0.73157
