program: Gaussian 09
title: 000102467
version: EM64L-G09RevD.01
frameworkgroup: C1[X(C7H16N2O2)]
method: RPBEPBE
basis: SDD
operation: Freq
keyword: #p
keyword: freq=noraman
keyword: PBEPBE/SDD
title: #p freq=noraman PBEPBE/SDD
converged: YES YES NO NO
title: Mulliken charges:
elementType: O O N N C C C C C C C H H H H H H H H H H H H H H H H
charge: -0.264707 -0.250507 -0.649858 -0.570878 -0.358645 -0.362259 -0.183304 -0.351653 -0.396332 0.205338 -0.502862 0.210921 0.203390 0.189265 0.226574 0.243255 0.176227 0.215589 0.209876 0.176315 0.313733 0.275559 0.256625 0.270360 0.241923 0.242675 0.233378
chargesum: 0.00000
title: Mulliken charges with hydrogens summed into heavy atoms:
elementType: O O N N C C C C C C C
charge: -0.264707 -0.250507 -0.060566 -0.043892 0.055667 0.053580 0.059951 0.040163 -0.010142 0.205338 0.215114
polarizability: 1.04936193e+02 2.26853310e+00 9.57462095e+01 -3.27944476e+00 2.50506224e+00 8.75177557e+01
1716.lowfreq: -12.2281 -8.4189 -0.0010 -0.0006 -0.0006 8.6097 25.7014 36.8392 57.9219
frequency: 25.5664 36.7978 57.7354 82.8340 99.5303 112.8657 135.2164 151.4099 169.4517 185.8306 206.3294 245.6885 309.8975 333.8452 346.5278 410.7493 456.0693 492.0395 557.8423 597.7259 605.4471 740.6537 749.2739 788.5678 806.7774 888.6488 915.2148 952.5855 967.2722 1035.2055 1057.4263 1073.2458 1098.5774 1113.5752 1115.3958 1136.9900 1149.5082 1159.7619 1187.3519 1202.1015 1234.4410 1256.8582 1281.0327 1287.6911 1295.5522 1331.8118 1360.6770 1368.5681 1385.0059 1424.1014 1452.0534 1453.1613 1464.3110 1465.0563 1478.1585 1493.2491 1596.3529 1636.7974 1647.3445 2862.4072 2901.9386 2951.8139 2958.8995 2986.2095 3005.3298 3008.4265 3018.2936 3038.5932 3056.6236 3107.2961 3150.2694 3448.2805 3497.6959 3576.2146 3643.9807
redmass: 4.0345 3.6940 1.9446 2.7632 1.0946 2.8496 2.2341 2.0419 1.4505 3.0380 3.0308 1.2477 3.0651 3.9153 3.7252 4.0031 3.2388 1.3980 3.0115 3.2260 1.3954 1.5891 2.0558 1.3320 3.3111 2.0331 2.1186 3.1106 2.0571 2.7867 1.9780 2.0392 2.3116 1.2953 1.8681 1.8471 1.7749 1.6990 1.6928 1.8087 1.4433 1.3455 1.0865 1.1740 1.2132 1.3814 1.5310 1.6098 1.4636 1.1932 1.0960 1.0501 1.0534 1.0673 1.0920 1.0901 1.6412 1.0942 2.4899 1.0716 1.0809 1.0646 1.0635 1.0605 1.0295 1.0847 1.0941 1.1006 1.1033 1.1046 1.1049 1.0447 1.0461 1.0973 1.0992
irintensity: 3.6465 0.4323 2.7112 2.2808 0.8531 2.7468 1.5411 7.0156 18.1458 16.8728 1.7504 51.3416 5.2419 5.5229 10.7893 21.6382 3.8310 207.5576 51.2469 43.4333 202.3989 12.7387 3.8531 2.9640 7.8328 4.0562 4.4814 4.3693 3.6275 2.8710 8.1204 1.8900 2.1118 2.1602 32.6456 118.0344 99.5190 69.3457 20.7237 13.7771 5.0944 2.5563 4.5655 0.2896 4.4799 2.9821 1.4909 1.8801 15.7423 14.4301 5.7131 13.8273 11.6422 0.6047 6.0409 5.3563 200.1114 39.0782 58.8685 112.0869 50.0327 24.7116 29.1008 53.3572 32.3064 32.8545 7.6835 14.6555 100.1516 26.9118 14.9645 2.3741 12.8763 0.1215 17.3654
temp: 298.150 k
press: 1.00000 atm
elementType: 8 8 7 7 6 6 6 6 6 6 6 1 1 1 1 1 1 1 1 1 1 1 1 1 1 1 1
symmnumber: 1
zpe: 609389.9 jmol-1
zpe.correction: 0.232104 hartree
zpe.thermalcorrener: 0.246658 hartree
zpe.thermalcorrenthalpy: 0.247602 hartree
zpe.thermalcorrgfe: 0.189056 hartree
zpe.sumelectzpe: -535.361054 hartree
zpe.sumelectthermal: -535.346500 hartree
zpe.sumelectthermalent: -535.345556 hartree
zpe.sumelectthermalfe: -535.404103 hartree
dipole: -0.8644 -1.7170 -1.1547
dipole: 2.2425
quadrupole: -67.4600 -56.9762 -70.5167
quadrupole: -4.5848 6.7970 -1.4855
quadrupole: -2.4757 8.0081 -5.5323 -4.5848 6.7970 -1.4855
hfenergy: -535.5931583 hartree
pointgroup: C01 [X(C7H16N2O2)]
dipole: -0.3562074 -0.6988397 -0.4038726 debye
polarizability: 105.1119331|1.7281746|95.9777846|-3.2081338|1.9508447|87.1104405 unknown
InChI: InChI=1S/C7H16N2O2/c1-11-7(10)6(9)4-2-3-5-8/h6H,2-5,8-9H2,1H3
charge 0 multiplicity 1
27 atoms
O  -2.101286 -1.105971 -0.607251
O  -2.50436 0.212159 1.266529
N  -1.202088 2.3690 0.165006
N  4.785952 -0.741715 0.197289
C  0.122813 0.670034 -1.142128
C  1.052977 0.266118 0.018693
C  -1.281217 1.167764 -0.669671
C  2.492127 -0.034768 -0.453048
C  3.421763 -0.46912 0.698419
C  -2.017455 0.079456 0.118845
C  -2.80523 -2.22361 0.068822
H  -0.017486 -0.176606 -1.841473
H  0.585373 1.500342 -1.711899
H  0.639008 -0.627652 0.531962
H  1.059968 1.089301 0.75939
H  -1.890079 1.32876 -1.590765
H  2.470964 -0.834448 -1.225179
H  2.932772 0.858938 -0.936001
H  3.486574 0.354399 1.435643
H  2.951342 -1.336043 1.227167
H  -1.744752 2.329097 1.031019
H  -1.225742 3.260726 -0.327268
H  4.821536 -1.485904 -0.507642
H  5.487833 -0.880679 0.930943
H  -3.849763 -1.942015 0.28379
H  -2.297751 -2.477793 1.014395
H  -2.757093 -3.057072 -0.645589
