program: Gaussian 09
title: 000102465
version: EM64L-G09RevD.01
frameworkgroup: C1[X(C13H26O3)]
method: RPBEPBE
basis: SDD
operation: Freq
keyword: #pfreq=noraman
keyword: PBEPBE/SDD
title: #p freq=noraman PBEPBE/SDD
converged: YES YES NO NO
title: Mulliken charges:
elementType: O O O C C C C C C C C C C C C C H H H H H H H H H H H H H H H H H H H H H H H H H H
charge: -0.175442 -0.201756 -0.210532 -0.135993 -0.421676 -0.346637 0.367087 -0.399392 -0.355058 -0.380123 0.217476 -0.745404 -0.709236 -0.698427 -0.708161 -0.698349 0.219780 0.196948 0.220740 0.213156 0.183772 0.203621 0.226397 0.194932 0.220917 0.191898 0.200988 0.210068 0.249432 0.234681 0.205212 0.227771 0.235090 0.233100 0.207956 0.217632 0.211380 0.216976 0.240558 0.216275 0.208566 0.213778
chargesum: 0.00000
title: Mulliken charges with hydrogens summed into heavy atoms:
elementType: O O O C C C C C C C C C C C C C
charge: -0.175442 -0.201756 -0.210532 0.083787 -0.003988 0.050291 0.367087 0.030626 0.037827 0.035726 0.217476 -0.051223 -0.041163 -0.039739 -0.039247 -0.059730
polarizability: 1.83868396e+02 -1.12414360e+01 1.63933481e+02 -1.77061922e-01 7.40959642e-02 1.30862505e+02
1716.lowfreq: -12.5116 -5.8543 -0.0009 -0.0008 0.0004 6.8454 19.7507 28.5980 40.8815
frequency: 15.9148 27.1806 39.4533 48.6165 67.1156 74.8546 84.7733 103.4607 107.0722 123.6793 150.9201 160.1599 184.3082 192.2631 197.9127 220.7743 225.0191 235.2094 255.6101 260.1983 274.0823 295.3874 321.6394 330.6429 376.7032 415.4274 427.1101 468.4825 510.4566 513.1370 616.8436 689.6340 704.9388 729.4844 762.1721 768.3486 780.2401 797.7928 825.4973 867.4687 883.9580 910.7824 914.4488 928.3644 939.6560 986.4627 990.0918 1005.4755 1010.9849 1032.5681 1048.5632 1052.8553 1071.5375 1073.1856 1082.9194 1102.8042 1121.8693 1144.9795 1170.9978 1206.5281 1208.3296 1238.0601 1244.2329 1257.5505 1271.7427 1287.4254 1294.3656 1294.8387 1323.6399 1327.8599 1343.0046 1345.2574 1358.1626 1372.3474 1387.6788 1387.8286 1392.2465 1396.6670 1445.1938 1454.7656 1461.2773 1464.0905 1464.5937 1465.9764 1467.8775 1475.4848 1476.3056 1477.4880 1480.5377 1484.2639 1487.0873 1488.3940 1498.3968 1674.3839 2957.3614 2965.4906 2972.4724 2974.0237 2976.8389 2984.4926 2985.0044 2988.9161 2990.9522 2997.7459 2998.0087 3001.0113 3020.7418 3038.3436 3042.6746 3047.7754 3069.2646 3072.1824 3074.7737 3077.0076 3080.5204 3086.2392 3091.3692 3096.3595 3100.5403 3108.5841
redmass: 3.6992 4.9387 3.2552 2.6826 1.8039 3.6375 2.4863 2.6109 2.3936 2.2094 1.1085 2.0041 1.8010 1.2165 2.8111 1.3127 3.0685 1.4807 1.6988 2.9558 1.9438 3.5336 2.7591 2.6857 2.7891 2.6832 2.9605 3.0131 4.0708 3.0733 3.0160 3.9098 3.6998 1.1312 2.5924 2.0845 1.3160 1.6396 1.7178 3.5696 2.1289 1.5581 1.8329 1.4546 1.5194 4.4498 1.2868 1.5682 3.3644 1.4283 3.1118 1.4549 2.0977 2.4601 2.0021 2.2595 1.8455 2.5541 2.1100 2.5116 1.4999 1.2764 2.1987 1.2235 1.2564 1.2065 1.4391 1.1137 1.4607 1.3619 1.5333 1.4324 1.5744 1.2178 1.2113 1.2130 1.2053 1.2117 1.0560 1.0775 1.0651 1.0742 1.0633 1.0693 1.0552 1.0524 1.0573 1.0522 1.0429 1.0504 1.0793 1.0549 1.0536 10.2548 1.0593 1.0599 1.0361 1.0602 1.0361 1.0605 1.0530 1.0374 1.0414 1.0364 1.0943 1.0873 1.1021 1.1022 1.0988 1.1022 1.1007 1.0995 1.1008 1.0994 1.0993 1.0992 1.1004 1.0992 1.1000 1.0997
irintensity: 0.6510 0.0510 0.2473 0.3650 0.2766 0.7239 0.9041 0.7249 0.4723 0.6194 0.1064 0.8216 0.9396 0.3195 0.6741 0.6657 1.9837 0.4606 0.5879 1.8801 0.5539 0.3134 3.0885 2.9845 1.9372 0.4986 0.9663 2.0182 3.0907 0.7109 0.2609 3.0607 4.3410 9.0913 1.5652 11.4195 2.1568 17.2504 4.3360 9.9072 7.9396 7.8890 2.5217 0.3794 34.4299 42.4419 1.6283 42.2961 110.2749 5.0728 2.9137 4.6402 9.2546 7.5344 8.6291 2.5751 13.9941 36.7465 54.7906 18.2635 4.8827 4.6308 28.0253 2.8668 4.1832 0.2067 6.6561 1.7774 2.0486 4.8950 7.6630 6.1060 2.0154 27.5328 2.1275 28.0330 12.8919 14.0142 2.5201 0.3633 3.8486 4.5370 9.2733 5.1213 1.4122 11.2292 4.1122 27.8903 14.3191 8.8208 19.7293 19.1107 1.0773 198.5194 3.4449 23.7131 36.4655 51.3025 32.0383 52.2208 17.5450 34.5769 22.3795 20.2911 0.2260 16.5908 8.1151 4.2947 8.4573 36.3200 75.3577 57.6138 62.5470 60.6387 36.1239 11.0421 37.7243 40.6707 28.4137 21.2685
temp: 298.150 k
press: 1.00000 atm
elementType: 8 8 8 6 6 6 6 6 6 6 6 6 6 6 6 6 1 1 1 1 1 1 1 1 1 1 1 1 1 1 1 1 1 1 1 1 1 1 1 1 1 1
symmnumber: 1
zpe: 964340.0 jmol-1
zpe.correction: 0.367298 hartree
zpe.thermalcorrener: 0.388765 hartree
zpe.thermalcorrenthalpy: 0.389709 hartree
zpe.thermalcorrgfe: 0.315106 hartree
zpe.sumelectzpe: -735.266886 hartree
zpe.sumelectthermal: -735.245419 hartree
zpe.sumelectthermalent: -735.244474 hartree
zpe.sumelectthermalfe: -735.319078 hartree
dipole: 0.4772 -0.5740 -3.2841
dipole: 3.3679
quadrupole: -90.1801 -95.9340 -106.9766
quadrupole: -5.2789 -0.1745 -2.6050
quadrupole: 7.5168 1.7629 -9.2797 -5.2789 -0.1745 -2.6050
hfenergy: -735.634184 hartree
pointgroup: C01 [X(C13H26O3)]
dipole: -0.1824742 0.2152385 -1.2946382 debye
polarizability: 183.966555|-11.1468479|163.8285443|0.5197623|-0.375972|130.8692822 unknown
InChI: InChI=1S/C13H26O3/c1-6-9-10-11(7-2)12(14)15-16-13(4,5)8-3/h11H,6-10H2,1-5H3
charge 0 multiplicity 1
42 atoms
O  -1.663426 0.600273 0.784221
O  -0.591628 -0.049559 -0.127278
O  0.338693 -0.862456 1.883947
C  1.368631 -1.38519 -0.315709
C  2.773174 -0.785617 -0.023616
C  2.873837 0.734337 -0.279861
C  -2.639914 1.279595 -0.136031
C  1.350285 -2.930322 -0.141825
C  4.295627 1.288366 -0.032557
C  -3.307654 0.24891 -1.084139
C  0.347729 -0.762169 0.645415
C  -3.614844 1.860816 0.91362
C  -1.930895 2.397635 -0.925303
C  0.003648 -3.584198 -0.516286
C  -3.975475 -0.949105 -0.378369
C  4.397402 2.809147 -0.277641
H  1.074589 -1.13311 -1.353435
H  3.507565 -1.316912 -0.662501
H  3.039677 -1.00551 1.029165
H  2.158098 1.271709 0.374946
H  2.569445 0.955894 -1.32419
H  2.157612 -3.348754 -0.774806
H  1.604889 -3.166724 0.90919
H  -4.051067 0.793205 -1.700646
H  -2.530773 -0.122518 -1.778481
H  5.015394 0.756889 -0.688679
H  4.597105 1.059734 1.009908
H  -4.463008 2.339472 0.391821
H  -4.008204 1.073537 1.577202
H  -3.109295 2.618966 1.535287
H  -2.666005 2.970603 -1.51968
H  -1.420949 3.092036 -0.235075
H  -1.179174 1.975515 -1.613497
H  -0.812359 -3.228743 0.139512
H  -0.277328 -3.354973 -1.561581
H  0.059122 -4.682996 -0.413033
H  -4.308927 -1.697035 -1.12041
H  -4.860366 -0.644782 0.208826
H  -3.262879 -1.439018 0.308477
H  5.421586 3.181423 -0.091495
H  4.129703 3.062341 -1.320959
H  3.709857 3.363388 0.388648
